1,1-Diethoxy-1-silacyclo-3-pentene
- Formula: C8H16O2Si
- Molecular weight: 172.2969
- IUPAC Standard InChIKey: ZEXYGAKMGFQRNC-UHFFFAOYSA-N
- CAS Registry Number: 67059-49-8
- Chemical structure:
View 3d structure (requires JavaScript / HTML 5) - Other names: 1,1-Diethoxy-1-sila-3-cyclopentene

Gas phase ion energetics data

Data compiled as indicated in comments:
LLK - Sharon G. Lias, Rhoda D. Levin, and Sherif A. Kafafi
Ionization energy determinations
IE (eV) | Method | Reference | Comment |
---|---|---|---|
9.44 | PE | Khvostenko, Zykov, et al., 1981 | Vertical value; LLK |

References

Khvostenko, Zykov, et al., 1981
Khvostenko, V.I.; Zykov, B.G.; Yuriev, V.P.; Mironov, V.F.; Kovel'zon, G.I.; Panasenko, A.A.; Sheludyakov, V.D.; Gailyunas, I.A.,
Study of d(π)-p(π) interaction in vinyl- and alkylsilicon-containing compounds by photoelectron spectroscopy,
J. Organomet. Chem., 1981, 218, 155. [all data]