2,5-Furandione, difluoro-
- Formula: C4F2O3
- Molecular weight: 134.0378
- IUPAC Standard InChIKey: DZTLWXJLPNCYDV-UHFFFAOYSA-N
- CAS Registry Number: 669-78-3
- Chemical structure:
View 3d structure (requires JavaScript / HTML 5) - Permanent link for this species. Use this link for bookmarking this species for future reference.

Gas phase ion energetics data

Data compiled as indicated in comments:
LLK - Sharon G. Lias, Rhoda D. Levin, and Sherif A. Kafafi
Ionization energy determinations
IE (eV) | Method | Reference | Comment |
---|---|---|---|
11.45 | PE | Asbrink, Svensson, et al., 1981 | LLK |
11.7 | PE | Asbrink, Svensson, et al., 1981 | Vertical value; LLK |

References

Asbrink, Svensson, et al., 1981
Asbrink, L.; Svensson, A.; Von Niessen, W.; Bieri, G.,
30.4 nm He(II) photoelectron spectra of organic molecules,
J. Electron Spectrosc. Relat. Phenom., 1981, 24, 293. [all data]