1-Thia-3-silacyclobutane, 3,3-diethyl-2,4-dimethyl-
- Formula: C8H18SSi
- Molecular weight: 174.379
- IUPAC Standard InChIKey: NTNZKNARJRBSST-UHFFFAOYSA-N
- CAS Registry Number: 66737-21-1
- Chemical structure:
View 3d structure (requires JavaScript / HTML 5) - Permanent link for this species. Use this link for bookmarking this species for future reference.

Gas phase ion energetics data

Data compiled as indicated in comments:
LLK - Sharon G. Lias, Rhoda D. Levin, and Sherif A. Kafafi
Ionization energy determinations
IE (eV) | Method | Reference | Comment |
---|---|---|---|
7.92 ± 0.03 | PI | Gusel'nikov, Volkova, et al., 1981 | LLK |
Appearance energy determinations
Ion | AE (eV) | Other Products | Method | Reference | Comment |
---|---|---|---|---|---|
C4H10SSi+ | 8.81 ± 0.03 | C4H8 | PI | Gusel'nikov, Volkova, et al., 1981 | LLK |
C4H11SSi+ | 8.69 ± 0.03 | C4H7 | PI | Gusel'nikov, Volkova, et al., 1981 | LLK |
C6H13SSi+ | 9.02 ± 0.03 | C2H5 | PI | Gusel'nikov, Volkova, et al., 1981 | LLK |
C6H14Si+ | 9.91 ± 0.03 | CH3CHS | PI | Gusel'nikov, Volkova, et al., 1981 | LLK |

References

Gusel'nikov, Volkova, et al., 1981
Gusel'nikov, L.E.; Volkova, V.V.; Zaikin, V.G.; Tarasenko, N.A.; Tishenkov, A.A.; Nametkin, N.S.; Voronkov, M.G.; Kirpichenko, S.V.,
Mass spectra of 3,3-dimethyl-3-silathietane and 3,3-diethyl-2,4-dimethyl-3-silathietane. First observation of silathione ions and calculation of their heats of formation,
J. Organomet. Chem., 1981, 215, 9. [all data]