o-Phenanthroline
- Formula: C12H8N2
- Molecular weight: 180.2053
- IUPAC Standard InChIKey: DGEZNRSVGBDHLK-UHFFFAOYSA-N
- CAS Registry Number: 66-71-7
- Chemical structure:

Phase change data

Data compiled by: William E. Acree, Jr., James S. Chickos
Enthalpy of vaporization
ΔvapH (kcal/mol) | Temperature (K) | Method | Reference |
---|---|---|---|
18.6 ± 0.02 | 520. | EB | Chirico, Kazakov, et al., 2010 |
17.9 ± 0.05 | 560. | EB | Chirico, Kazakov, et al., 2010 |
17.2 ± 0.05 | 600. | EB | Chirico, Kazakov, et al., 2010 |
Enthalpy of fusion
ΔfusH (kcal/mol) | Temperature (K) | Method | Reference |
---|---|---|---|
3.70 | 391.7 | AC | Chirico, Kazakov, et al., 2010 |
2.82 | 391.1 | DSC | Bonicelli, Catalani, et al., 2007 |

Gas phase ion energetics data

Data compiled as indicated in comments:
MM - Michael M. Meot-Ner (Mautner)
LLK - Sharon G. Lias, Rhoda D. Levin, and Sherif A. Kafafi
Gas basicity at 298K
Gas basicity (review) (kcal/mol) | Reference | Comment |
---|---|---|
>217. | Shen and Brodbelt, 1998 | GB > 18-Crown-6. From PT bracketing at nominal 300 K, but ion energies are undefined. Reference GB readjusted to Hunter and Lias, 1998; MM |
Ionization energy determinations
IE (eV) | Method | Reference | Comment |
---|---|---|---|
8.3 | PE | Hush, Cheung, et al., 1975 | LLK |
8.51 ± 0.02 | PE | Hush, Cheung, et al., 1975 | Vertical value; LLK |

References

Chirico, Kazakov, et al., 2010
Chirico, Robert D.; Kazakov, Andrei F.; Steele, William V.,
Thermodynamic properties of three-ring aza-aromatics. 2. Experimental results for 1,10-phenanthroline, phenanthridine, and 7,8-benzoquinoline, and mutual validation of experiments and computational methods,
The Journal of Chemical Thermodynamics, 2010, 42, 5, 581-590, https://doi.org/10.1016/j.jct.2009.11.011
. [all data]
Bonicelli, Catalani, et al., 2007
Bonicelli, M.G.; Catalani, A.; Mariano, G.; Vecchio, S.,
Heat capacities and molar enthalpies and entropies of fusion for anhydrous 1,10-phenanthroline and 2,9-dimethyl-1,10-phenanthroline,
Thermochimica Acta, 2007, 466, 1-2, 69-71, https://doi.org/10.1016/j.tca.2007.10.001
. [all data]
Shen and Brodbelt, 1998
Shen, J.; Brodbelt, J.,
Evaluation of proton-binding capabilities of polyether and pyridyl ligands,
J. Mass Spectrom., 1998, 33, 118. [all data]
Hunter and Lias, 1998
Hunter, E.P.; Lias, S.G.,
Evaluated Gas Phase Basicities and Proton Affinities of Molecules: An Update,
J. Phys. Chem. Ref. Data, 1998, 27, 3, 413-656, https://doi.org/10.1063/1.556018
. [all data]
Hush, Cheung, et al., 1975
Hush, N.S.; Cheung, A.S.; Hilton, P.R.,
Binding energies of π- and "lone pair"-levels in mono- and diaza-phenanthrenes and anthracenes: an He(I) photoelectron spectroscopic study,
J. Electron Spectrosc. Relat. Phenom., 1975, 7, 385. [all data]