1,2,3-Trioxolane
- Formula: C2H4O3
- Molecular weight: 76.0514
- IUPAC Standard InChIKey: MAAKQSASDHJHIR-UHFFFAOYSA-N
- CAS Registry Number: 6669-36-9
- Chemical structure:
View 3d structure (requires JavaScript / HTML 5) - Permanent link for this species. Use this link for bookmarking this species for future reference.

Gas phase thermochemistry data

Data compiled by: Glushko Thermocenter, Russian Academy of Sciences, Moscow
Constant pressure heat capacity of gas
Cp,gas (J/mol*K) | Temperature (K) | Reference | Comment |
---|---|---|---|
39.26 | 50. | Dorofeeva O.V., 1992 | p=1 bar. |
46.05 | 100. | ||
51.52 | 150. | ||
58.85 | 200. | ||
72.77 | 273.15 | ||
78.0 ± 4.5 | 298.15 | ||
78.34 | 300. | ||
98.49 | 400. | ||
115.56 | 500. | ||
129.23 | 600. | ||
140.21 | 700. | ||
149.18 | 800. | ||
156.62 | 900. | ||
162.86 | 1000. | ||
168.13 | 1100. | ||
172.62 | 1200. | ||
176.46 | 1300. | ||
179.75 | 1400. | ||
182.59 | 1500. |

Vibrational and/or electronic energy levels

Data compiled by: Marilyn E. Jacox
State: X
Vib. sym. |
No. | Approximate type of mode |
cm-1 | Med. | Method | References | |
---|---|---|---|---|---|---|---|
CH2 deform. | 1214 | m | Xe | IR | Kohlmiller and Andrews, 1981 | ||
CO st., CH2def. | 983 | s | Xe | IR | Kohlmiller and Andrews, 1981 | ||
CO st., CH2def. | 982 | CO2 | IR | Nelander and Nord, 1977 Kohlmiller and Andrews, 1981 | |||
CO stretch | 927 | s | Xe | IR | Kohlmiller and Andrews, 1981 | ||
CO stretch | 926 | CO2 | IR | Nelander and Nord, 1977 Kohlmiller and Andrews, 1981 | |||
O3 s-stretch | 846 | w m | Xe | IR | Kohlmiller and Andrews, 1981 | ||
COO def.,CO st. | 727 | vs | Xe | IR | Kohlmiller and Andrews, 1981 | ||
COO def.,CO st. | 726 | CO2 | IR | Nelander and Nord, 1977 Kohlmiller and Andrews, 1981 | |||
O3 a-stretch | 647 | vs | Xe | IR | Kohlmiller and Andrews, 1981 | ||
O3 a-stretch | 648 | CO2 | IR | Nelander and Nord, 1977 Kohlmiller and Andrews, 1981 | |||
O3 bend | 409 | m | Xe | IR | Kohlmiller and Andrews, 1981 | ||
O3 bend | 406 | CO2 | IR | Nelander and Nord, 1977 Kohlmiller and Andrews, 1981 | |||
Additional references: Jacox, 1994, page 422; Jacox, 1998, page 366; Zozom, Gillies, et al., 1987; Gillies, Gillies, et al., 1988

References

Dorofeeva O.V., 1992
Dorofeeva O.V.,
Ideal gas thermodynamic properties of oxygen heterocyclic compounds. Part 1. Three-membered, four-membered and five-membered rings,
Thermochim. Acta, 1992, 194, 9-46. [all data]
Kohlmiller and Andrews, 1981
Kohlmiller, C.K.; Andrews, L.,
Infrared spectrum of the primary ozonide of ethylene in solid xenon,
J. Am. Chem. Soc., 1981, 103, 10, 2578, https://doi.org/10.1021/ja00400a016
. [all data]
Nelander and Nord, 1977
Nelander, B.; Nord, L.,
Tetrahedron Lett., 1977, 2821. [all data]
Jacox, 1994
Jacox, M.E.,
Vibrational and electronic energy levels of polyatomic transient molecules, American Chemical Society, Washington, DC, 1994, 464. [all data]
Jacox, 1998
Jacox, M.E.,
Vibrational and electronic energy levels of polyatomic transient molecules: supplement A,
J. Phys. Chem. Ref. Data, 1998, 27, 2, 115-393, https://doi.org/10.1063/1.556017
. [all data]
Zozom, Gillies, et al., 1987
Zozom, J.; Gillies, C.W.; Suenram, R.D.; Lovas, F.J.,
Microwave detection of the primary ozonide of ethylene in the gas phase,
Chem. Phys. Lett., 1987, 140, 1, 64, https://doi.org/10.1016/0009-2614(87)80418-9
. [all data]
Gillies, Gillies, et al., 1988
Gillies, J.Z.; Gillies, C.W.; Suenram, R.D.; Lovas, F.J.,
The ozonolysis of ethylene. Microwave spectrum, molecular structure, and dipole moment of ethylene primary ozonide (1,2,3-trioxolane),
J. Am. Chem. Soc., 1988, 110, 24, 7991, https://doi.org/10.1021/ja00232a007
. [all data]