Benzene, (1,1-dimethylethoxy)-
- Formula: C10H14O
- Molecular weight: 150.2176
- IUPAC Standard InChIKey: PNKZBZPLRKCVLI-UHFFFAOYSA-N
- CAS Registry Number: 6669-13-2
- Chemical structure:
View 3d structure (requires JavaScript / HTML 5) - Other names: Ether, tert-butyl phenyl; tert-Butoxybenzene; tert-Butyl phenyl ether; t-Butoxybenzene; (1,1-Dimethylethoxy)benzene

Phase change data

Data compiled by: Thermodynamics Research Center, NIST Boulder Laboratories, Chris Muzny director
Quantity | Value | Units | Method | Reference | Comment |
---|---|---|---|---|---|
Tboil | 471.15 | K | N/A | Natelson, 1934 | Uncertainty assigned by TRC = 5. K |
Tboil | 465.15 | K | N/A | Smith, 1933 | Uncertainty assigned by TRC = 3. K |
Quantity | Value | Units | Method | Reference | Comment |
Tfus | 254.84 | K | N/A | Olson, Hipsher, et al., 1947 | Uncertainty assigned by TRC = 0.3 K |

Gas phase ion energetics data

Data compiled as indicated in comments:
LLK - Sharon G. Lias, Rhoda D. Levin, and Sherif A. Kafafi
RDSH - Henry M. Rosenstock, Keith Draxl, Bruce W. Steiner, and John T. Herron
Ionization energy determinations
IE (eV) | Method | Reference | Comment |
---|---|---|---|
8.77 | PE | Friege and Klessinger, 1979 | Vertical value; LLK |
8.66 | PE | Dewar, Ernstbrunner, et al., 1974 | Vertical value; LLK |
8.75 | PE | Baker, May, et al., 1968 | Vertical value; RDSH |

Van Den Dool and Kratz RI, non-polar column, temperature ramp

Column type | Active phase | I | Reference | Comment |
---|---|---|---|---|
Capillary | CP-Sil 8CB-MS | 1074. | Elmore, Cooper, et al., 2005 | 0. m/0.25 mm/0.25 μm, He, 40. C @ 2. min, 4. K/min, 280. C @ 5. min |

Normal alkane RI, polar column, temperature ramp

Column type | Active phase | I | Reference | Comment |
---|---|---|---|---|
Packed | Carbowax 20M | 1336. | Tsao, 1969 | Helium, Chromosorb P HMDS, 5. K/min; Column length: 2. m; Tstart: 40. C; Tend: 200. C |

References

Natelson, 1934
Natelson, S.,
Rearrangement of Alkyl Phenyl Ethers on Heating at Moderate Temp. Synthesis of Tertiary Amyl, Tertiary Butyl and Diisobutyl Phenols,
J. Am. Chem. Soc., 1934, 56, 1583. [all data]
Smith, 1933
Smith, R.A.,
Studies in the Rearrangements of Phenyl Ethers. The Action of Aluminum Chloride on Butyl Phenyl Ethers,
J. Am. Chem. Soc., 1933, 55, 3718. [all data]
Olson, Hipsher, et al., 1947
Olson, W.T.; Hipsher, H.F.; Buess, C.M.; Goodman, I.A.; Hart, I.; Lamneck, J.H.; Gibbons, L.C.,
The Synthesis and Purification of Ethers,
J. Am. Chem. Soc., 1947, 69, 2451-4. [all data]
Friege and Klessinger, 1979
Friege, H.; Klessinger, M.,
Elektronenstruktur von Alkyl-aryl- und Alkyl-vinyl-ethern,
Chem. Ber., 1979, 112, 1614. [all data]
Dewar, Ernstbrunner, et al., 1974
Dewar, P.S.; Ernstbrunner, E.; Gilmore, J.R.; Godfrey, M.; Mellor, J.M.,
Conformational analysis of alkyl aryl ethers and alkyl aryl sulphides by photoelectron spectroscopy,
Tetrahedron, 1974, 30, 2455. [all data]
Baker, May, et al., 1968
Baker, A.D.; May, D.P.; Turner, D.W.,
Molecular photoelectron spectroscopy. Part VII. The vertical ionisation potentials of benzene and some of its monosubstituted and 1,4-disubstituted derivatives,
J. Chem. Soc. B, 1968, 22. [all data]
Lang (editor), 1971
Lang (editor), L.,
Absorption Spectra in the Ultraviolet and Visible Region, 1971, 15, 21. [all data]
Elmore, Cooper, et al., 2005
Elmore, J.S.; Cooper, S.L.; Enser, M.; Mottram, D.S.; Sinclair, L.A.; Wilkinson, R.G.; Wood, J.D.,
Dietary manipulation of fatty acid composition in lamb meat and its effect on the volatile aroma compounds of grilled lamb,
Meat Sci., 2005, 69, 2, 233-242, https://doi.org/10.1016/j.meatsci.2004.07.002
. [all data]
Tsao, 1969
Tsao, J.C.Y.,
Prelimivary reports on structural study via mercury-sensitized photolysis and gas chromatography,
J. Chin. Chem. Soc., 1969, 16, 4, 152-163. [all data]