Acetone-D6
- Formula: C3D6O
- Molecular weight: 64.1161
- IUPAC Standard InChIKey: CSCPPACGZOOCGX-WFGJKAKNSA-N
- CAS Registry Number: 666-52-4
- Chemical structure:
View 3d structure (requires JavaScript / HTML 5) - Isotopologues:
- Other names: 2-Propanone-1,1,1,3,3,3-D6-; Perdeuteroacetone; (CD3)2CO; Acetone, perdeutero-; (2H6)acetone

Reaction thermochemistry data

Data compiled by: Robert C. Dunbar
Individual Reactions
By formula: Mn+ + C3D6O = (Mn+ • C3D6O)
Quantity | Value | Units | Method | Reference | Comment |
---|---|---|---|---|---|
ΔrH° | 144. ± 14. | kJ/mol | RAK,EJ | Lin, Chen, et al., 1997 |
By formula: Cr+ + C3D6O = (Cr+ • C3D6O)
Quantity | Value | Units | Method | Reference | Comment |
---|---|---|---|---|---|
ΔrH° | 156. ± 14. | kJ/mol | RAK | Lin, Chen, et al., 1997 |

Gas phase ion energetics data

Data compiled as indicated in comments:
LLK - Sharon G. Lias, Rhoda D. Levin, and Sherif A. Kafafi
B - John E. Bartmess
Electron affinity determinations
EA (eV) | Reference | Comment |
---|---|---|
0.002517 ± 0.000087 | Hammer, Diri, et al., 2003 | B |
Ionization energy determinations
IE (eV) | Method | Reference | Comment |
---|---|---|---|
9.695 ± 0.006 | PI | Trott, Blais, et al., 1978 | LLK |
9.68 | PE | Brundle, Robin, et al., 1972 | LLK |
Appearance energy determinations
Ion | AE (eV) | Other Products | Method | Reference | Comment |
---|---|---|---|---|---|
C2D3O+ | 10.56 ± 0.02 | CD3 | PI | Trott, Blais, et al., 1978 | LLK |

Ion clustering data

Data compiled by: Robert C. Dunbar
Clustering reactions
By formula: Cr+ + C3D6O = (Cr+ • C3D6O)
Quantity | Value | Units | Method | Reference | Comment |
---|---|---|---|---|---|
ΔrH° | 156. ± 14. | kJ/mol | RAK | Lin, Chen, et al., 1997 |
By formula: Mn+ + C3D6O = (Mn+ • C3D6O)
Quantity | Value | Units | Method | Reference | Comment |
---|---|---|---|---|---|
ΔrH° | 144. ± 14. | kJ/mol | RAK,EJ | Lin, Chen, et al., 1997 |

Vibrational and/or electronic energy levels

Data compiled by: Takehiko Shimanouchi
Symmetry: C2ν Symmetry Number σ = 2
Sym. | No | Approximate | Selected Freq. | Infrared | Raman | Comments | ||||
---|---|---|---|---|---|---|---|---|---|---|
Species | type of mode | Value | Rating | Value | Phase | Value | Phase | |||
a1 | 1 | CD3 d-str | 2264 | C | 2263.5 S | gas | SF(ν13) | |||
a1 | 2 | CD3 s-str | 2123 | C | 2123 W | gas | 2108.5 VS p | liq. | SF(ν14) | |
a1 | 3 | CO str | 1732 | C | 1732 VS | gas | 1700.5 S | liq. | ||
a1 | 4 | CD3 s-deform | 1080 | C | 1080 M | gas | 1088 M p | liq. | ||
a1 | 5 | CD3 d-deform | 1035 | D | 1035 M | gas | 1036 M | liq. | ||
a1 | 6 | CD3 rock | 887 | C | 887 W | gas | 889 M p | liq. | ||
a1 | 7 | CC str | 689 | C | 689 W | gas | 695.5 VS p | liq. | ||
a1 | 8 | CCC deform | 321 | C | 321 W | gas | 330 VW dp | liq. | ||
a2 | 9 | CD3 d-str | 2219 | E | ia | CF | ||||
a2 | 10 | CD3 d-deform | 1021 | E | ia | CF | ||||
a2 | 11 | CD3 rock | 669 | E | ia | CF | ||||
a2 | 12 | Torsion | 75 | E | ia | CF | ||||
b1 | 13 | CD3 d-str | 2264 | C | 2263.5 S | gas | 2256.5 S | liq. | SF(ν1) | |
b1 | 14 | CD3 s-str | 2123 | C | 2123 W | gas | SF(ν2) | |||
b1 | 15 | CC str | 1242 | C | 1241.7 VS | gas | 1248.5 VW | liq. | ||
b1 | 16 | CD3 s-deform | 1035 | D | 1035 M | gas | 1036 M | liq. | ||
b1 | 17 | CD3 d-deform | 1004 | C | 1004 M | gas | 1006 sh | liq. | ||
b1 | 18 | CD3 rock | 724 | D | 724 W | sln. | ||||
b1 | 19 | CO ip-bend | 475 | C | 475 S | gas | 478 W dp | liq. | ||
b2 | 20 | CD3 d-str | 2227 | C | 2226.5 S | gas | 2222 S | liq. | ||
b2 | 21 | CD3 d-deform | 1050 | C | 1050 S | gas | ||||
b2 | 22 | CD3 rock | 960 | C | 960 M | gas | ||||
b2 | 23 | CO op-bend | 405 | C | 405 W | gas | 410 VW dp | liq. | ||
b2 | 24 | Torsion | 79 | E | CF | |||||
Source: Shimanouchi, 1972

References

Lin, Chen, et al., 1997
Lin, C.-Y.; Chen, Q.; Chen, H.; Freiser, B.S.,
Bond Dissociation Energy Determinations for MOC(CH3)2+ and MOC(CD3)2+ (M=Cr, Mn) Using Continuous Ejection and Radiative Association Methods,
Int. J. Mass Spectrom. Ion Proc., 1997, 167/168, 713, https://doi.org/10.1016/S0168-1176(97)00131-6
. [all data]
Hammer, Diri, et al., 2003
Hammer, N.I.; Diri, K.; Jordan, K.D.; Desfrancois, C.; Compton, R.N.,
Dipole-bound anions of carbonyl, nitrile, and sulfoxide containing molecules,
J. Chem. Phys., 2003, 119, 7, 3650-3660, https://doi.org/10.1063/1.1590959
. [all data]
Trott, Blais, et al., 1978
Trott, W.M.; Blais, N.C.; Walters, E.A.,
Molecular beam photoionization study of acetone and acetone-d6,
J. Chem. Phys., 1978, 69, 3150. [all data]
Brundle, Robin, et al., 1972
Brundle, C.R.; Robin, M.B.; Kuebler, N.A.; Basch, H.,
Perfluoro effect in photoelectron spectroscopy. I. Nonaromatic molecules,
J. Am. Chem. Soc., 1972, 94, 1451. [all data]
Shimanouchi, 1972
Shimanouchi, T.,
Tables of Molecular Vibrational Frequencies Consolidated Volume I, National Bureau of Standards, 1972, 1-160. [all data]