Stannane, dimethylbis(1-methylethyl)-

Gas phase ion energetics data

Data compiled by: Sharon G. Lias, Rhoda D. Levin, and Sherif A. Kafafi

Ionization energy determinations

IE (eV) Method Reference Comment
8.56PEKochi, 1980Vertical value

References

Kochi, 1980
Kochi, J.K., The role of electron transfer and charge transfer in organometallic chemistry, Pure Appl. Chem., 1980, 52, 571. [all data]