Tris(trifluoromethyl)chlorogermane
- Formula: C3ClF9Ge
- Molecular weight: 315.11
- IUPAC Standard InChIKey: VKCQPKOVFIVMCB-UHFFFAOYSA-N
- CAS Registry Number: 66348-17-2
- Chemical structure:
View 3d structure (requires JavaScript / HTML 5) - Permanent link for this species. Use this link for bookmarking this species for future reference.

Gas phase ion energetics data

Data compiled by: Sharon G. Lias, John E. Bartmess, Joel F. Liebman, John L. Holmes, Rhoda D. Levin, and W. Gary Mallard
Ionization energy determinations
IE (eV) | Method | Reference | Comment |
---|---|---|---|
11.3 | PE | Drake, Gorzelska, et al., 1982 | |
12.10 | PE | Drake, Gorzelska, et al., 1982 | Vertical value |

References

Drake, Gorzelska, et al., 1982
Drake, J.E.; Gorzelska, K.; White, G.S.; Eujen, R.,
Photoelectron spectra of trifluoromethyl(bromo)- and trifluoromethyl(chloro)-germanes (CF3)4-nGeXn (X = Br, Cl n = 1-3),
J. Electron Spectrosc. Relat. Phenom., 1982, 26, 1. [all data]