3,3,4,4-Tetrafluorocyclobutane-1,2-dione
- Formula: C4F4O2
- Molecular weight: 156.0352
- IUPAC Standard InChIKey: UCNKOBZYBHPLOR-UHFFFAOYSA-N
- CAS Registry Number: 663-45-6
- Chemical structure:
View 3d structure (requires JavaScript / HTML 5) - Permanent link for this species. Use this link for bookmarking this species for future reference.

Gas phase ion energetics data

Data compiled as indicated in comments:
LBLHLM - Sharon G. Lias, John E. Bartmess, Joel F. Liebman, John L. Holmes, Rhoda D. Levin, and W. Gary Mallard
Ionization energy determinations
IE (eV) | Method | Reference | Comment |
---|---|---|---|
10.1 | PE | Gleiter, Schang, et al., 1985 | LBLHLM |
10.0 | PE | Albert, Heller, et al., 1985 | LBLHLM |
10.45 | PE | Gleiter, Schang, et al., 1985 | Vertical value; LBLHLM |
10.48 | PE | Albert, Heller, et al., 1985 | Vertical value; LBLHLM |

References

Gleiter, Schang, et al., 1985
Gleiter, R.; Schang, P.; Bloch, M.; Heilbronner, E.; Bunzli, J.-C.; Frost, D.C.; Weiler, L.,
The He(Iα) PE spectra and electronic absorption spectra of hexafluorocyclobutanone and of tetrafluoro-1,2-cyclobutanedione,
Chem. Ber., 1985, 118, 2127. [all data]
Albert, Heller, et al., 1985
Albert, B.; Heller, C.; Iden, R.; Martin, G.; Martin, H.-D.; Mayer, B.; Oftring, A.,
Design and synthesis of α-diketones. The cyclobutane-1,2-dione chromophore: Synthesis, dienophilic reactivity and electronic properties of cyclobutenedione and polycyclic cyclobutanediones,
Isr. J. Chem., 1985, 25, 74. [all data]