Oxazole, 4-methyl-
- Formula: C4H5NO
- Molecular weight: 83.0886
- IUPAC Standard InChIKey: PUMREIFKTMLCAF-UHFFFAOYSA-N
- CAS Registry Number: 66333-88-8
- Chemical structure:
View 3d structure (requires JavaScript / HTML 5) - Permanent link for this species. Use this link for bookmarking this species for future reference.

Gas phase ion energetics data

Data compiled by: Sharon G. Lias, John E. Bartmess, Joel F. Liebman, John L. Holmes, Rhoda D. Levin, and W. Gary Mallard
Ionization energy determinations
IE (eV) | Method | Reference | Comment |
---|---|---|---|
9.0 | PE | Kobayashi, Kubota, et al., 1982 | |
9.27 | PE | Kobayashi, Kubota, et al., 1982 | Vertical value |

References

Kobayashi, Kubota, et al., 1982
Kobayashi, T.; Kubota, T.; Ezumi, K.; Utsunomiya, C.,
Photoelectron angular distribution study of some isoxazoles combined with perturbation theoretic approach,
Bull. Chem. Soc. Jpn., 1982, 55, 3915. [all data]