Trimethylgermyl fluoride
- Formula: C3H9FGe
- Molecular weight: 136.74
- IUPAC Standard InChIKey: IKGVVUJGGQFCSM-UHFFFAOYSA-N
- CAS Registry Number: 661-37-0
- Chemical structure:
View 3d structure (requires JavaScript / HTML 5) - Permanent link for this species. Use this link for bookmarking this species for future reference.

Phase change data

Data compiled by: William E. Acree, Jr., James S. Chickos
Enthalpy of vaporization
ΔvapH (kJ/mol) | Temperature (K) | Method | Reference | Comment |
---|---|---|---|---|
32.4 | 315. | SG | Griffiths and Onyszchuk, 1961 | Based on data from 285. to 345. K. |
Enthalpy of sublimation
ΔsubH (kJ/mol) | Temperature (K) | Method | Reference | Comment |
---|---|---|---|---|
40.0 | 267. | SG | Stephenson and Malanowski, 1987 | Based on data from 250. to 284. K. See also Griffiths and Onyszchuk, 1961. |

Gas phase ion energetics data

Data compiled by: Sharon G. Lias, Rhoda D. Levin, and Sherif A. Kafafi
Ionization energy determinations
IE (eV) | Method | Reference | Comment |
---|---|---|---|
~10.0 | PE | Drake, Glavincevski, et al., 1979 | |
10.49 | PE | Drake, Glavincevski, et al., 1979 | Vertical value |

References

Griffiths and Onyszchuk, 1961
Griffiths, J.E.; Onyszchuk, M.,
ORGANOGERMANIUM COMPOUNDS: PART I. THE INTERACTION OF HEXAMETHYLDIGERMOXANE AND TRIMETHYLMETHOXYGERMANE WITH BORON TRIFLUORIDE,
Can. J. Chem., 1961, 39, 2, 339-347, https://doi.org/10.1139/v61-040
. [all data]
Stephenson and Malanowski, 1987
Stephenson, Richard M.; Malanowski, Stanislaw,
Handbook of the Thermodynamics of Organic Compounds, 1987, https://doi.org/10.1007/978-94-009-3173-2
. [all data]
Drake, Glavincevski, et al., 1979
Drake, J.E.; Glavincevski, B.M.; Gorzelska, K.,
The photoelectron spectra of trimethylgermane, chloro- and fluoro-trimethylgermane,
J. Electron Spectrosc. Relat. Phenom., 1979, 16, 331. [all data]