5-Aminovaleric acid
- Formula: C5H11NO2
- Molecular weight: 117.1463
- IUPAC Standard InChIKey: JJMDCOVWQOJGCB-UHFFFAOYSA-N
- CAS Registry Number: 660-88-8
- Chemical structure:
View 3d structure (requires JavaScript / HTML 5) - Other names: Valeric acid, 5-amino-; δ-Amino-n-valeric acid; δ-Aminovaleric acid; 5-Aminopentanoic acid; H2N(CH2)4COOH; Pentanoic acid, 5-amino-

Gas phase thermochemistry data

Data compiled by: Hussein Y. Afeefy, Joel F. Liebman, and Stephen E. Stein
Quantity | Value | Units | Method | Reference | Comment |
---|---|---|---|---|---|
ΔfH°gas | -460.2 ± 3.0 | kJ/mol | Ccb | Skoulika and Sabbah, 1983 |

Condensed phase thermochemistry data

Data compiled as indicated in comments:
ALS - Hussein Y. Afeefy, Joel F. Liebman, and Stephen E. Stein
DH - Eugene S. Domalski and Elizabeth D. Hearing
Quantity | Value | Units | Method | Reference | Comment |
---|---|---|---|---|---|
ΔfH°solid | -604.17 ± 0.42 | kJ/mol | Ccb | Skoulika and Sabbah, 1983 | ALS |
Quantity | Value | Units | Method | Reference | Comment |
ΔcH°solid | -2935.49 ± 0.42 | kJ/mol | Ccb | Skoulika and Sabbah, 1983 | ALS |
ΔcH°solid | -2935.5 ± 0.84 | kJ/mol | Ccb | Strepikheev, Skuratov, et al., 1955 | Reanalyzed by Cox and Pilcher, 1970, Original value = -2936. kJ/mol; At 293 °K; ALS |
Constant pressure heat capacity of solid
Cp,solid (J/mol*K) | Temperature (K) | Reference | Comment |
---|---|---|---|
163.7 | 298. | Skoulika and Sabbah, 1983 | DH |

Phase change data

Data compiled as indicated in comments:
ALS - Hussein Y. Afeefy, Joel F. Liebman, and Stephen E. Stein
AC - William E. Acree, Jr., James S. Chickos
Quantity | Value | Units | Method | Reference | Comment |
---|---|---|---|---|---|
ΔsubH° | 144. ± 3. | kJ/mol | C | Skoulika and Sabbah, 1983 | ALS |
Enthalpy of sublimation
ΔsubH (kJ/mol) | Temperature (K) | Method | Reference | Comment |
---|---|---|---|---|
141.8 ± 0.5 | 389. | C | Skoulika and Sabbah, 1983 | Based on data from 384. to 394. K.; AC |
144. ± 3. | 289. | C | Skoulika and Sabbah, 1983 | AC |

Gas phase ion energetics data

Data compiled as indicated in comments:
LBLHLM - Sharon G. Lias, John E. Bartmess, Joel F. Liebman, John L. Holmes, Rhoda D. Levin, and W. Gary Mallard
Ionization energy determinations
IE (eV) | Method | Reference | Comment |
---|---|---|---|
9.4 | PE | Cannington and Ham, 1983 | Vertical value; LBLHLM |

References

Skoulika and Sabbah, 1983
Skoulika, S.; Sabbah, R.,
Thermodynamique de composes azotes X. Etude thermochimique de quelques acides ω-amines,
Thermochim. Acta, 1983, 61, 203-214. [all data]
Strepikheev, Skuratov, et al., 1955
Strepikheev, A.A.; Skuratov, S.M.; Shtekher, S.M.; Muromova, R.S.; Brykina, E.P.; Kachinskaya, O.N.,
Mutual interaction of amino and carboxyl groups in amino acids,
Dokl. Akad. Nauk SSSR, 1955, 102, 543-545. [all data]
Cox and Pilcher, 1970
Cox, J.D.; Pilcher, G.,
Thermochemistry of Organic and Organometallic Compounds, Academic Press, New York, 1970, 1-636. [all data]
Cannington and Ham, 1983
Cannington, P.H.; Ham, N.S.,
He(I) and He(II) photoelectron spectra of glycine and related molecules,
J. Electron Spectrosc. Relat. Phenom., 1983, 32, 139. [all data]