HNO radical anion
- Formula: HNO-
- Molecular weight: 31.0146
- CAS Registry Number: 66057-02-1

Gas phase thermochemistry data

Data compiled by: John E. Bartmess
Quantity | Value | Units | Method | Reference | Comment |
---|---|---|---|---|---|
ΔfH°gas | 74.5 ± 1.5 | kJ/mol | R-EA | Ellis and Ellison, 1983 |

Vibrational and/or electronic energy levels

Data compiled by: Marilyn E. Jacox
State: ?
Energy (cm-1) |
Med. | Transition | λmin (nm) |
λmax (nm) |
References | ||
---|---|---|---|---|---|---|---|
Td = 2730 ± 120 | gas | Ellis and Ellison, 1983 | |||||
State: X
Vib. sym. |
No. | Approximate type of mode |
cm-1 | Med. | Method | References | |
---|---|---|---|---|---|---|---|
a' | 1 | NH stretch | 2750.78 | gas | PD | Miller, Hardwick, et al., 1989 | |
3 | NO stretch | 1153 ± 170 | gas | PE | Ellis and Ellison, 1983 | ||
Additional references: Jacox, 1994, page 48

References

Ellis and Ellison, 1983
Ellis, H.B., Jr.; Ellison, G.B.,
Photoelectron spectroscopy of HNO- and DNO-,
J. Chem. Phys., 1983, 78, 6541. [all data]
Miller, Hardwick, et al., 1989
Miller, H.C.; Hardwick, J.L.; Farley, J.W.,
The vibration-rotation spectrum of the ν1 band of nitroxide, HNO-,
J. Mol. Spectrosc., 1989, 134, 2, 329, https://doi.org/10.1016/0022-2852(89)90320-2
. [all data]
Jacox, 1994
Jacox, M.E.,
Vibrational and electronic energy levels of polyatomic transient molecules, American Chemical Society, Washington, DC, 1994, 464. [all data]