norvaline
- Formula: C5H11NO2
- Molecular weight: 117.1463
- IUPAC Standard InChIKey: SNDPXSYFESPGGJ-SCSAIBSYSA-N
- CAS Registry Number: 6600-40-4
- Chemical structure:
View 3d structure (requires JavaScript / HTML 5) - Stereoisomers:
- Other names: L-Norvaline

Gas phase ion energetics data

Data compiled as indicated in comments:
LLK - Sharon G. Lias, Rhoda D. Levin, and Sherif A. Kafafi
Ionization energy determinations
IE (eV) | Method | Reference | Comment |
---|---|---|---|
8.53 | PE | Klasinc, 1976 | LLK |

References

Klasinc, 1976
Klasinc, L.,
Application of photoelectron spectroscopy to biologically active molecules and their constituent parts,
J. Electron Spectrosc. Relat. Phenom., 1976, 8, 161. [all data]