Arsenous acid, trimethyl ester
- Formula: C3H9AsO3
- Molecular weight: 168.0234
- IUPAC Standard InChIKey: JQWDUIXUOQTLKR-UHFFFAOYSA-N
- CAS Registry Number: 6596-95-8
- Chemical structure:

Phase change data

Data compiled by: William E. Acree, Jr., James S. Chickos
Quantity | Value | Units | Method | Reference | Comment |
---|---|---|---|---|---|
ΔvapH° | 42.3 ± 1.3 | kJ/mol | N/A | Charnley, Mortimer, et al., 1953 | Based on data from 300. to 335. K. See also Cox and Pilcher, 1970. |

Gas phase ion energetics data

Data compiled by: Sharon G. Lias, Rhoda D. Levin, and Sherif A. Kafafi
Ionization energy determinations
IE (eV) | Method | Reference | Comment |
---|---|---|---|
7.93 | EI | Preiss, 1974 | |
9.73 | PE | Cowley, Lattman, et al., 1977 | Vertical value |
Appearance energy determinations
Ion | AE (eV) | Other Products | Method | Reference | Comment |
---|---|---|---|---|---|
CH2OAs+ | 13.88 | ? | EI | Preiss, 1974 | |
CH3OAs+ | 10.63 | ? | EI | Preiss, 1974 | |
CH4OAs+ | 13.48 | ? | EI | Preiss, 1974 | |
C2H5O2As+ | 8.98 | CH3OH | EI | Preiss, 1974 | |
C2H6O2As+ | 10.03 | CH3O | EI | Preiss, 1974 | |
C2H7O2As+ | 8.80 | CH2O | EI | Preiss, 1974 |

References

Charnley, Mortimer, et al., 1953
Charnley, T.; Mortimer, C.T.; Skinner, H.A.,
236. The thermochemistry of organo-arsenic compounds. Part II. Esters of arsenious acid,
J. Chem. Soc., 1953, 1181, https://doi.org/10.1039/jr9530001181
. [all data]
Cox and Pilcher, 1970
Cox, J.D.; Pilcher, G.,
Thermochemistry of Organic and Organometallic Compounds, Academic Press Inc., London, 1970, 643. [all data]
Preiss, 1974
Preiss, H.,
Die Massenspektren einiger arsen- und arsenigsaureester. Kinetische untersuchung ihres fragmentierungsverhaltens,
Z. Anorg. Allg. Chem., 1974, 404, 175. [all data]
Cowley, Lattman, et al., 1977
Cowley, A.H.; Lattman, M.; Montag, R.A.; Verkade, J.G.,
The coordination behavior of acyclic phosphites; a UV photoelectron spectroscopic study,
Inorg. Chim. Acta, 1977, 25, 151. [all data]