Benzoic acid
- Formula: C7H6O2
- Molecular weight: 122.1213
- IUPAC Standard InChIKey: WPYMKLBDIGXBTP-UHFFFAOYSA-N
- CAS Registry Number: 65-85-0
- Chemical structure:
View 3d structure (requires JavaScript / HTML 5) - Other names: Benzenecarboxylic acid; Benzeneformic acid; Benzenemethanoic acid; Benzoesaeure GK; Benzoesaeure GV; Carboxybenzene; Dracylic acid; Phenylcarboxylic acid; Phenylformic acid; Retarder BA; Retardex; Salvo, liquid; Solvo, powder; Tenn-Plas; Acide benzoique; Benzoic acid, tech.; Kyselina benzoova; Benzoesaeure; Salvo powder; E 210; HA 1; HA 1 (acid); Phenylcarboxy; Benzenemethonic acid; Diacylic acid; Flowers of benjamin; Flowers of benzoin; Oracylic acid; Retarder BAX; NSC 149

Gas phase thermochemistry data

Data compiled by: Glushko Thermocenter, Russian Academy of Sciences, Moscow
Constant pressure heat capacity of gas
Cp,gas (J/mol*K) | Temperature (K) | Reference | Comment |
---|---|---|---|
103.47 | 298.15 | Stull D.R., 1969 | These values were calculated from preliminary assignment of vibrational frequencies. Statistical calculation [ Ali N., 1983] seems to be erroneous. |
104.01 | 300. | ||
138.36 | 400. | ||
170.54 | 500. | ||
196.73 | 600. | ||
217.82 | 700. | ||
234.89 | 800. | ||
248.95 | 900. | ||
260.66 | 1000. |

Reaction thermochemistry data

Data compiled as indicated in comments:
B - John E. Bartmess
M - Michael M. Meot-Ner (Mautner) and Sharon G. Lias
ALS - Hussein Y. Afeefy, Joel F. Liebman, and Stephen E. Stein
Individual Reactions
By formula: C7H5O2- + H+ = C7H6O2
Quantity | Value | Units | Method | Reference | Comment |
---|---|---|---|---|---|
ΔrH° | 1423. ± 9.2 | kJ/mol | G+TS | Fujio, McIver, et al., 1981 | gas phase; value altered from reference due to change in acidity scale; B |
ΔrH° | 1423. ± 12. | kJ/mol | G+TS | Cumming and Kebarle, 1978 | gas phase; Recalculated from data in paper; error in Table vs. ladder; B |
ΔrH° | 1423. ± 9.2 | kJ/mol | G+TS | Caldwell, Renneboog, et al., 1989 | gas phase; B |
Quantity | Value | Units | Method | Reference | Comment |
ΔrG° | 1393. ± 8.4 | kJ/mol | IMRE | Fujio, McIver, et al., 1981 | gas phase; value altered from reference due to change in acidity scale; B |
ΔrG° | 1393. ± 8.4 | kJ/mol | IMRE | Cumming and Kebarle, 1978 | gas phase; Recalculated from data in paper; error in Table vs. ladder; B |
ΔrG° | 1394. ± 8.4 | kJ/mol | IMRE | Caldwell, Renneboog, et al., 1989 | gas phase; B |
By formula: Br- + C7H6O2 = (Br- • C7H6O2)
Quantity | Value | Units | Method | Reference | Comment |
---|---|---|---|---|---|
ΔrH° | 76.6 ± 7.5 | kJ/mol | IMRE | Paul and Kebarle, 1991 | gas phase; ΔGaff measured at 423 K, ΔSaff taken as that of PhNO2..Br-; B,M |
Quantity | Value | Units | Method | Reference | Comment |
ΔrS° | 84. | J/mol*K | N/A | Paul and Kebarle, 1991 | gas phase; Entropy change calculated or estimated; M |
Quantity | Value | Units | Method | Reference | Comment |
ΔrG° | 41. ± 4.2 | kJ/mol | IMRE | Paul and Kebarle, 1991 | gas phase; ΔGaff measured at 423 K, ΔSaff taken as that of PhNO2..Br-; B |
Free energy of reaction
ΔrG° (kJ/mol) | T (K) | Method | Reference | Comment |
---|---|---|---|---|
41. | 423. | PHPMS | Paul and Kebarle, 1991 | gas phase; Entropy change calculated or estimated; M |
By formula: H2O + C7H5ClO = C7H6O2 + HCl
Quantity | Value | Units | Method | Reference | Comment |
---|---|---|---|---|---|
ΔrH° | -34.04 ± 0.21 | kJ/mol | Cm | Moselhy and Pritchard, 1975 | liquid phase; solvent: Diphenyl-ether; see Carson, Pritchard, et al., 1950 and Davies, Dunning, et al., 1972; ALS |
ΔrH° | -101.9 | kJ/mol | Cm | Carson, Pritchard, et al., 1950 | liquid phase; Heat of hydrolysis; ALS |
By formula: C7H6O + C7H6O3 = 2C7H6O2
Quantity | Value | Units | Method | Reference | Comment |
---|---|---|---|---|---|
ΔrH° | -316. ± 13. | kJ/mol | Cm | Briner and Chastonay, 1954 | liquid phase; Reanalyzed by Cox and Pilcher, 1970, Original value = -317. ± 13. kJ/mol; ALS |
By formula: C7H5BrO + H2O = HBr + C7H6O2
Quantity | Value | Units | Method | Reference | Comment |
---|---|---|---|---|---|
ΔrH° | -113.1 | kJ/mol | Cm | Carson, Pritchard, et al., 1950 | liquid phase; Heat of hydrolysis; ALS |
By formula: C7H5IO + H2O = HI + C7H6O2
Quantity | Value | Units | Method | Reference | Comment |
---|---|---|---|---|---|
ΔrH° | -102.4 | kJ/mol | Cm | Carson, Pritchard, et al., 1950 | liquid phase; Heat of hydrolysis; ALS |
By formula: H2O + C8H8O2 = C7H6O2 + CH4O
Quantity | Value | Units | Method | Reference | Comment |
---|---|---|---|---|---|
ΔrH° | -73.0 ± 1.9 | kJ/mol | Eqk | Guthrie and Cullimore, 1980 | liquid phase; ALS |

Gas phase ion energetics data

Data evaluated as indicated in comments:
HL - Edward P. Hunter and Sharon G. Lias
Data compiled as indicated in comments:
B - John E. Bartmess
LBLHLM - Sharon G. Lias, John E. Bartmess, Joel F. Liebman, John L. Holmes, Rhoda D. Levin, and W. Gary Mallard
LLK - Sharon G. Lias, Rhoda D. Levin, and Sherif A. Kafafi
RDSH - Henry M. Rosenstock, Keith Draxl, Bruce W. Steiner, and John T. Herron
Quantity | Value | Units | Method | Reference | Comment |
---|---|---|---|---|---|
Proton affinity (review) | 821.1 | kJ/mol | N/A | Hunter and Lias, 1998 | HL |
Quantity | Value | Units | Method | Reference | Comment |
Gas basicity | 790.1 | kJ/mol | N/A | Hunter and Lias, 1998 | HL |
Ionization energy determinations
IE (eV) | Method | Reference | Comment |
---|---|---|---|
9.3 | PE | Klasinc, Kovac, et al., 1983 | LBLHLM |
9.6 | PE | Meeks, Wahlborg, et al., 1981 | LLK |
9.8 ± 0.2 | EI | Benoit, 1973 | LLK |
9.75 | EI | Benoit, 1973, 2 | LLK |
9.73 ± 0.09 | EI | Foffani, Pignataro, et al., 1964 | RDSH |
9.47 | PE | Klasinc, Kovac, et al., 1983 | Vertical value; LBLHLM |
Appearance energy determinations
Ion | AE (eV) | Other Products | Method | Reference | Comment |
---|---|---|---|---|---|
C6H5+ | 14.3 ± 0.07 | ? | EI | Tajima, Azami, et al., 1977 | LLK |
C6H5+ | 15.1 ± 0.2 | CO+OH | EI | Benoit, 1973 | LLK |
C6H5+ | 15.08 | CO+OH | EI | Benoit, 1973, 2 | LLK |
C7H5O+ | 11.5 ± 0.07 | OH | EI | Tajima, Azami, et al., 1977 | LLK |
C7H5O+ | 12.1 ± 0.2 | OH | EI | Benoit, 1973 | LLK |
C7H5O+ | 12.11 | OH | EI | Benoit, 1973, 2 | LLK |
De-protonation reactions
By formula: C7H5O2- + H+ = C7H6O2
Quantity | Value | Units | Method | Reference | Comment |
---|---|---|---|---|---|
ΔrH° | 1423. ± 9.2 | kJ/mol | G+TS | Fujio, McIver, et al., 1981 | gas phase; value altered from reference due to change in acidity scale; B |
ΔrH° | 1423. ± 12. | kJ/mol | G+TS | Cumming and Kebarle, 1978 | gas phase; Recalculated from data in paper; error in Table vs. ladder; B |
ΔrH° | 1423. ± 9.2 | kJ/mol | G+TS | Caldwell, Renneboog, et al., 1989 | gas phase; B |
Quantity | Value | Units | Method | Reference | Comment |
ΔrG° | 1393. ± 8.4 | kJ/mol | IMRE | Fujio, McIver, et al., 1981 | gas phase; value altered from reference due to change in acidity scale; B |
ΔrG° | 1393. ± 8.4 | kJ/mol | IMRE | Cumming and Kebarle, 1978 | gas phase; Recalculated from data in paper; error in Table vs. ladder; B |
ΔrG° | 1394. ± 8.4 | kJ/mol | IMRE | Caldwell, Renneboog, et al., 1989 | gas phase; B |

Ion clustering data

Data compiled as indicated in comments:
B - John E. Bartmess
M - Michael M. Meot-Ner (Mautner) and Sharon G. Lias
Clustering reactions
By formula: Br- + C7H6O2 = (Br- • C7H6O2)
Quantity | Value | Units | Method | Reference | Comment |
---|---|---|---|---|---|
ΔrH° | 76.6 ± 7.5 | kJ/mol | IMRE | Paul and Kebarle, 1991 | gas phase; ΔGaff measured at 423 K, ΔSaff taken as that of PhNO2..Br-; B,M |
Quantity | Value | Units | Method | Reference | Comment |
ΔrS° | 84. | J/mol*K | N/A | Paul and Kebarle, 1991 | gas phase; Entropy change calculated or estimated; M |
Quantity | Value | Units | Method | Reference | Comment |
ΔrG° | 41. ± 4.2 | kJ/mol | IMRE | Paul and Kebarle, 1991 | gas phase; ΔGaff measured at 423 K, ΔSaff taken as that of PhNO2..Br-; B |
Free energy of reaction
ΔrG° (kJ/mol) | T (K) | Method | Reference | Comment |
---|---|---|---|---|
41. | 423. | PHPMS | Paul and Kebarle, 1991 | gas phase; Entropy change calculated or estimated; M |

Condensed phase thermochemistry data

Data compiled as indicated in comments:
ALS - Hussein Y. Afeefy, Joel F. Liebman, and Stephen E. Stein
DH - Eugene S. Domalski and Elizabeth D. Hearing
Quantity | Value | Units | Method | Reference | Comment |
---|---|---|---|---|---|
ΔcH°liquid | -771.272 ± 0.048 | kcal/mol | Ccb | Gundry, Harrop, et al., 1969 | Reanalyzed by Pedley, Naylor, et al., 1986, Original value = -770.968 kcal/mol; Corresponding ΔfHºliquid = -92.032 kcal/mol (simple calculation by NIST; no Washburn corrections); ALS |
Quantity | Value | Units | Method | Reference | Comment |
ΔfH°solid | -91.98 ± 0.12 | kcal/mol | Ccb | Corral, 1960 | ALS |
ΔfH°solid | -92.2 | kcal/mol | Ccb | Landrieu, Baylocq, et al., 1929 | ALS |
Quantity | Value | Units | Method | Reference | Comment |
ΔcH°solid | -772. ± 1. | kcal/mol | AVG | N/A | Average of 17 out of 18 values; Individual data points |
Quantity | Value | Units | Method | Reference | Comment |
S°solid,1 bar | 39.606 | cal/mol*K | N/A | Kaji, Tochigi, et al., 1993 | DH |
S°solid,1 bar | 40.088 | cal/mol*K | N/A | Arvidsson, Falk, et al., 1976 | DH |
S°solid,1 bar | 40.055 | cal/mol*K | N/A | Furukawa, McCoskey, et al., 1951 | DH |
S°solid,1 bar | 40.110 | cal/mol*K | N/A | Davies and Staveley, 1957 | DH |
S°solid,1 bar | 40.80 | cal/mol*K | N/A | Parks, Huffman, et al., 1933 | Extrapolation below 90 K, 59.25 J/mol*K.; DH |
Constant pressure heat capacity of liquid
Cp,liquid (cal/mol*K) | Temperature (K) | Reference | Comment |
---|---|---|---|
61.9 | 413. | Pacor, 1967 | DH |
Constant pressure heat capacity of solid
Cp,solid (cal/mol*K) | Temperature (K) | Reference | Comment |
---|---|---|---|
35.320 | 300. | Kaji, Tochigi, et al., 1993 | T = 19 to 312 K. Unsmoothed experimental datum.; DH |
35.141 | 298.902 | Sorai, Kaji, et al., 1992 | T = 15 to 305 K. Unsmoothed experimental datum.; DH |
34.950 | 296.29 | Moriya, Matsuo, et al., 1982 | T = 13 to 355 K. NBS SRM 29.; DH |
35.050 | 298.15 | Shakirov and Lyubarskii, 1980 | T = 20 to 300 K.; DH |
35.084 | 298.15 | Arvidsson, Falk, et al., 1976 | T = 6 to 341 K.; DH |
35.151 | 299.62 | Tatsumi, Matsuo, et al., 1975 | T = 12 to 304 K.; DH |
35.6 | 301. | Mosselman, Mourik, et al., 1974 | One temperature, T = 5 K. Value 5 J/mol*K.; DH |
35.086 | 298.15 | Konicek, Suurkuusk, et al., 1971 | DH |
40.010 | 298.15 | Justice, 1969 | As check on system. Only value at 298 K given.; DH |
35.167 | 299.99 | Suga and Seki, 1965 | T = 13 to 300 K. Value is unsmoothed experimental datum.; DH |
31.1 | 340. | David, 1964 | T = 298 to 373 K. Mean value. T = uncertain.; DH |
34.969 | 298.15 | Kolesov, Seregin, et al., 1962 | T = 22 to 310 K.; DH |
35.139 | 298.15 | Davies and Staveley, 1957 | T = 20 to 298 K.; DH |
35.801 | 298.15 | Popov and Kolesov, 1956 | T = 80 to 300 K.; DH |
35.088 | 298.15 | Ginnings and Furukawa, 1953 | T = 14 to 410 K.; DH |
35.088 | 298.15 | Furukawa, McCoskey, et al., 1951 | T = 13 to 410 K.; DH |
38.29 | 323. | Satoh and Sogabe, 1939 | T = 0 to 100 C. Mean value.; DH |
34.680 | 295.1 | Parks, Huffman, et al., 1933 | T = 93 to 295 K. Value is unsmoothed experimental datum.; DH |
37.09 | 298. | Andrews, Lynn, et al., 1926 | T = 22 to 200 C.; DH |

Phase change data

Data compiled as indicated in comments:
BS - Robert L. Brown and Stephen E. Stein
TRC - Thermodynamics Research Center, NIST Boulder Laboratories, Chris Muzny director
AC - William E. Acree, Jr., James S. Chickos
DH - Eugene S. Domalski and Elizabeth D. Hearing
ALS - Hussein Y. Afeefy, Joel F. Liebman, and Stephen E. Stein
Quantity | Value | Units | Method | Reference | Comment |
---|---|---|---|---|---|
Tboil | 522.2 | K | N/A | Weast and Grasselli, 1989 | BS |
Tboil | 522. | K | N/A | Buckingham and Donaghy, 1982 | BS |
Tboil | 523.18 | K | N/A | Burriel, 1931 | Uncertainty assigned by TRC = 0.2 K; TRC |
Tboil | 523.59 | K | N/A | Burriel, 1931 | Uncertainty assigned by TRC = 0.2 K; TRC |
Quantity | Value | Units | Method | Reference | Comment |
Tfus | 395.2 ± 0.7 | K | AVG | N/A | Average of 18 out of 20 values; Individual data points |
Quantity | Value | Units | Method | Reference | Comment |
Ttriple | 395.52 | K | N/A | Marsh, 1987 | Uncertainty assigned by TRC = 0.005 K; recommended as calibration standard; TRC |
Ttriple | 395.520 | K | N/A | Andon and Connett, 1980 | Uncertainty assigned by TRC = 0.01 K; TRC |
Ttriple | 395.52 | K | N/A | Ginnings and Furukawa, 1953, 2 | Uncertainty assigned by TRC = 0.01 K; TRC |
Ttriple | 395.52 | K | N/A | Furukawa, McCoskey, et al., 1951, 2 | Uncertainty assigned by TRC = 0.01 K; TRC |
Quantity | Value | Units | Method | Reference | Comment |
ΔvapH° | 18.9 | kcal/mol | CGC | Chickos, Hosseini, et al., 1995 | Based on data from 353. to 393. K.; AC |
Quantity | Value | Units | Method | Reference | Comment |
ΔsubH° | 21.4 ± 0.9 | kcal/mol | AVG | N/A | Average of 13 values; Individual data points |
Reduced pressure boiling point
Tboil (K) | Pressure (atm) | Reference | Comment |
---|---|---|---|
406.2 | 0.013 | Weast and Grasselli, 1989 | BS |
406. | 0.013 | Buckingham and Donaghy, 1982 | BS |
Enthalpy of vaporization
ΔvapH (kcal/mol) | Temperature (K) | Method | Reference | Comment |
---|---|---|---|---|
20.901 | 335. | N/A | Torres-Gomez, Barreiro-Rodriguez, et al., 1988 | DH |
15.1 ± 0.1 | 401. to 416. | N/A | Pena, Ribet, et al., 2003 | AC |
15.8 | 420. | A | Stephenson and Malanowski, 1987 | Based on data from 405. to 523. K.; AC |
16.2 | 368. to 428. | GS | Matsubara and Kuwamoto, 1985 | AC |
15.6 | 428. | I | Cramer, 1943 | AC |
16.2 | 416. | MM,A | Klosky, Woo, et al., 1927 | Based on data from 401. to 520. K.; AC |
Entropy of vaporization
ΔvapS (cal/mol*K) | Temperature (K) | Reference | Comment |
---|---|---|---|
62.38 | 335. | Torres-Gomez, Barreiro-Rodriguez, et al., 1988 | DH |
Antoine Equation Parameters
log10(P) = A − (B / (T + C))
P = vapor pressure (atm)
T = temperature (K)
View plot Requires a JavaScript / HTML 5 canvas capable browser.
Temperature (K) | A | B | C | Reference | Comment |
---|---|---|---|---|---|
369. to 522.4 | 4.47263 | 1771.357 | -127.484 | Stull, 1947 | Coefficents calculated by NIST from author's data. |
Enthalpy of sublimation
ΔsubH (kcal/mol) | Temperature (K) | Method | Reference | Comment |
---|---|---|---|---|
21.326 | 298.15 | N/A | Torres-Gomez, Barreiro-Rodriguez, et al., 1988 | DH |
21.7 ± 0.48 | 340. to 410. | TG-TS | Selvakumar, Raghunathan, et al., 2009 | AC |
21.5 ± 0.1 | 307. | ME | Ribeiro da Silva, Monte, et al., 2006 | Based on data from 299. to 317. K.; AC |
22.1 ± 1. | 294. to 331. | ME | Ginkel, Kruif, et al., 2001 | AC |
21.6 ± 0.07 | 323. to 394. | GS | Zielenkiewicz, Perlovich, et al., 1999 | AC |
20.7 | 313. to 343. | TGA | Elder, 1997 | AC |
21.2 ± 0.2 | 311. | ME | Da Silva and Monte, 1990 | Based on data from 307. to 314. K.; AC |
20.9 ± 0.07 | 335. | C | Torres-Gomez, Barreiro-Rodriguez, et al., 1988 | AC |
21.7 ± 0.1 | 306. | QR | Glukhova, Arkhangelova, et al., 1985 | Based on data from 293. to 319. K.; AC |
22.7 ± 0.43 | 294. | N/A | Kaisersberger, Hädrich, et al., 1985 | AC |
21.0 | 368. to 428. | GS | Matsubara and Kuwamoto, 1985 | AC |
21.7 ± 0.5 | 293. to 313. | ME | Colomina, Jimenez, et al., 1982 | AC |
21.4 ± 0.01 | 353. | DM | de Kruif and Blok, 1982 | Based on data from 316. to 391. K.; AC |
21.3 ± 0.05 | 320. to 370. | C | Murata, Sakiyama, et al., 1982 | AC |
20. ± 0.5 | 369. | SG | Sachinidis and Hill, 1980 | Based on data from 344. to 395. K.; AC |
21.1 ± 0.69 | 281. to 323. | LE | Nowak, Szczepaniak, et al., 1978 | AC |
21.2 ± 0.38 | 293. to 318. | TE | DeKruif, van Ginkel, et al., 1975 | AC |
22.2 ± 0.05 | 296. | ME | Arshadi, 1974 | Based on data from 273. to 318. K.; AC |
21.1 ± 0.05 | 293. to 311. | TCM | de Kruif and Oonk, 1973 | AC |
21.3 ± 0.1 | 338. to 383. | ME | Malaspina, 1973 | AC |
21.3 ± 0.1 | 338. to 383. | C | Malaspina, 1973 | AC |
22. ± 0.07 | 293. to 308. | ME | Colomina, Monzon, et al., 1972 | AC |
20.7 ± 0.31 | 290. to 315. | ME,C | Wiedemann, 1972 | AC |
21.3 | 314. | N/A | Ashcroft, 1971 | Based on data from 299. to 329. K.; AC |
21.6 ± 0.2 | 367. | HSA | Melia and Merrifield, 1970 | Based on data from 324. to 392. K.; AC |
20.7 ± 0.41 | 303. | ME | Wiedemann and Waughna, 1970 | Based on data from 290. to 315. K. See also Zielenkiewicz, Perlovich, et al., 1999.; AC |
21.2 ± 0.1 | 363. | GS | Mertl, 1968 | Based on data from 348. to 378. K.; AC |
21.7 | 299. | ME | Davies and Kybett, 1965 | Based on data from 291. to 307. K.; AC |
20.1 ± 0.2 | 318. | TE | Wolf and Weghofer, 1938 | AC |
20.1 ± 0.2 | 318. | V | Wolf and Weghofer, 1938, 2 | ALS |
20.5 | 383. | T | Hirsbrunner, 1934 | Based on data from 333. to 389. K.; AC |
20.2 ± 0.1 | 364. | I | Klosky, Woo, et al., 1927 | Based on data from 377. to 394. K.; AC |
Entropy of sublimation
ΔsubS (cal/mol*K) | Temperature (K) | Reference | Comment |
---|---|---|---|
71.53 | 298.15 | Torres-Gomez, Barreiro-Rodriguez, et al., 1988 | DH |
Enthalpy of fusion
ΔfusH (kcal/mol) | Temperature (K) | Method | Reference | Comment |
---|---|---|---|---|
4.3035 | 395.52 | N/A | Ginnings and Furukawa, 1953 | DH |
4.3021 | 395.52 | N/A | Furukawa, McCoskey, et al., 1951 | DH |
4.061 | 396.9 | DSC | Brittain, 2009 | AC |
4.13 | 394.4 | DSC | Sharma, Kant, et al., 2003 | See also Sharma, Jamwal, et al., 2004.; AC |
4.09 | 395.4 | DSC | Roy, Riga, et al., 2002 | AC |
4.300 | 395.5 | N/A | Pitzer, Peiper, et al., 1984 | AC |
3.8791 | 395. | N/A | Pacor, 1967 | DH |
4.1396 | 395.0 | N/A | Andrews, Lynn, et al., 1926 | DH |
4.1587 | 395. | N/A | David, 1964 | Temperature not measured.; DH |
Entropy of fusion
ΔfusS (cal/mol*K) | Temperature (K) | Reference | Comment |
---|---|---|---|
10.88 | 395.52 | Ginnings and Furukawa, 1953 | DH |
10.88 | 395.52 | Furukawa, McCoskey, et al., 1951 | DH |
9.82 | 395. | Pacor, 1967 | DH |
10.5 | 395.0 | Andrews, Lynn, et al., 1926 | DH |
11. | 395. | David, 1964 | Temperature; DH |
Enthalpy of phase transition
ΔHtrs (kcal/mol) | Temperature (K) | Initial Phase | Final Phase | Reference | Comment |
---|---|---|---|---|---|
4.3169 | 395.527 | crystaline, I | liquid | Andon and Connett, 1980, 2 | DH |
Entropy of phase transition
ΔStrs (cal/mol*K) | Temperature (K) | Initial Phase | Final Phase | Reference | Comment |
---|---|---|---|---|---|
10.92 | 395.527 | crystaline, I | liquid | Andon and Connett, 1980, 2 | DH |

Henry's Law data

Data compiled by: Rolf Sander
Henry's Law constant (water solution)
kH(T) = k°H exp(d(ln(kH))/d(1/T) ((1/T) - 1/(298.15 K)))
k°H = Henry's law constant for solubility in water at 298.15 K (mol/(kg*bar))
d(ln(kH))/d(1/T) = Temperature dependence constant (K)
k°H (mol/(kg*bar)) | d(ln(kH))/d(1/T) (K) | Method | Reference | Comment |
---|---|---|---|---|
24000. | Q | N/A | missing citation give several references for the Henry's law constants but don't assign them to specific species. | |
14000. | 6500. | X | N/A |

Normal alkane RI, non-polar column, custom temperature program

Data compiled by: NIST Mass Spectrometry Data Center, William E. Wallace, director

Column type CapillaryCapillaryCapillaryCapillaryCapillary
Active phase SLB-5 MSSLB-5 MS CP-Sil 8 CBZB-5
Column length (m) 30.30. 30.30.
Carrier gas HeliumHelium HydrogenHelium
Substrate
Column diameter (mm) 0.250.25 0.250.25
Phase thickness (μm) 0.250.25 0.250.25
Program not specifiednot specifiednot specified30 0C 3 0C/min -> 150 0C 20 0C/min -> 220 0C45 0C 3 0C/min -> 230 0C (10 min) 10 0C/min -> 270 0C (21 min)
I 1150.1167.1164.1184.1164.
ReferenceMondello, 2012Mondello, 2012Brandi, Bar, et al., 2011de Freitas, Garruti, et al., 2011de Simon, Estruelas, et al., 2009
Comment MSDC-RI MSDC-RI MSDC-RI MSDC-RI MSDC-RI
Column type CapillaryCapillaryCapillaryCapillaryCapillary
Active phase CB-1CB-1HP-5HP-5HP-5MS
Column length (m) 30.30.30.30.30.
Carrier gas HeliumHelium  He
Substrate
Column diameter (mm) 0.250.250.250.250.25
Phase thickness (μm) 0.250.250.250.250.25
Program 40 0C (2 min) 4 0C/min -> 180 0C 20 0C/min -> 220 0C (1 min)not specified40 0C (2 min) 5 0C/min -> 80 0C 7 oC/min -> 160 0C 9 0C/min -> 200 0C 20 0C/min -> 280 0C (10 min)not specified40C => 3C/min => 100C => 5C/min => 230C(2min)
I 1165.1160.1159.1162.1163.
ReferenceKannaste, Vongvanich, et al., 2008Kannaste, Vongvanich, et al., 2008Zhao, Li, et al., 2008Zhao, Li, et al., 2008Chokeprasert P., Charles A.L., et al., 2007
Comment MSDC-RI MSDC-RI MSDC-RI MSDC-RI MSDC-RI
Column type CapillaryCapillaryCapillaryCapillaryCapillary
Active phase DB-5HP-5MSSE-30SPB-5BPX-5
Column length (m) 30.30. 60.60.
Carrier gas HeliumHe  He
Substrate
Column diameter (mm) 0.320.25 0.320.32
Phase thickness (μm) 0.250.25 1.1.
Program not specified40C(3min) => 2C/min => 180C => 10C/min => 250C(5min)not specifiednot specified40C (4min) => 2C/min => 90C => 4C/min => 130C => 8C/min => 250 C (10min)
I 1199.1197.1152.1156.1171.
ReferencePellicer, 2007Alissandrakis, Kibaris, et al., 2005Vinogradov, 2004Begnaud, Pérès, et al., 2003Machiels, van Ruth, et al., 2003
Comment MSDC-RI MSDC-RI MSDC-RI MSDC-RI MSDC-RI
Column type CapillaryCapillaryCapillaryCapillaryCapillary
Active phase DB-5DB-5CP Sil 5 CBCP Sil 5 CBHP-1
Column length (m) 30.30.50.50.25.
Carrier gas   HeHe
Substrate
Column diameter (mm) 0.200.200.320.320.32
Phase thickness (μm) 1.01.0 1.2
Program not specifiednot specified30C => 55C/min => 85C => 1C/min => 145C => 3C/min => 250C30C => 55C/min => 85C => 1C/min => 145C => 3C/min => 250Cnot specified
I 1196.1210.1155.1135.1167.
ReferenceRapior, Breheret, et al., 2002Rapior, Breheret, et al., 2002Guyot, Scheirman, et al., 1999Guyot, Bouseta, et al., 1998Ong, Acree, et al., 1998
Comment MSDC-RI MSDC-RI MSDC-RI MSDC-RI MSDC-RI
Column type CapillaryCapillaryOther
Active phase HP-5DB-1Methyl Silicone
Column length (m) 50.100.
Carrier gas He
Substrate
Column diameter (mm) 0.320.25
Phase thickness (μm) 0.520.5
Program 35 0C 10 0C/min -> 200 0C (20 min) 5 0C/min -> 230 0C (50 min)not specifiednot specified
I 1180.1163.1180.
ReferenceTimón, Ventanas, et al., 1998Hathcock and Bertsch, 1993Ardrey and Moffat, 1981
Comment MSDC-RI MSDC-RI MSDC-RI

Van Den Dool and Kratz RI, polar column, temperature ramp

Data compiled by: NIST Mass Spectrometry Data Center, William E. Wallace, director

Column type CapillaryCapillaryCapillaryCapillaryCapillary
Active phase DB-WaxDB-WaxSupelcowax-10StabilwaxCarbowax 20M
Column length (m) 30.30.60.30.60.
Carrier gas HeHe N2He
Substrate
Column diameter (mm) 0.250.250.250.320.25
Phase thickness (μm) 0.50.250.251.0.25
Tstart (C) 40.50.35.40.45.
Tend (C) 250.220.195.230.250.
Heat rate (K/min) 4.4.6.4.2.
Initial hold (min) 5.4.5.2.0.17
Final hold (min) 15.20.60.10.
I 2433.2412.2387.2446.2380.
ReferencePozo-Bayon M.A., Ruiz-Rodriguez A., et al., 2007Osorio, Alarcon, et al., 2006Chung, Fung, et al., 2005Fang and Qian, 2005Verzera, Campisi, et al., 2005
Comment MSDC-RI MSDC-RI MSDC-RI MSDC-RI MSDC-RI
Column type CapillaryCapillaryCapillaryCapillaryCapillary
Active phase Supelcowax-10CP-Wax 52CBDB-WaxDB-WaxDB-Wax
Column length (m) 30.60.30.30.30.
Carrier gas HeHeH2H2H2
Substrate
Column diameter (mm) 0.250.250.320.320.25
Phase thickness (μm) 0.250.251.1.0.25
Tstart (C) 50.45.40.40.60.
Tend (C) 230.250.210.210.220.
Heat rate (K/min) 3.2.3.3.2.
Initial hold (min)  0.17  3.
Final hold (min) 30.
I 2444.2380.2420.2423.2405.
ReferenceMoreira, Trugo, et al., 2002Verzera, Campisi, et al., 2001Moio, Piombino, et al., 2000Moio, Piombino, et al., 2000Chassagne, Boulanger, et al., 1999
Comment MSDC-RI MSDC-RI MSDC-RI MSDC-RI MSDC-RI
Column type CapillaryCapillaryCapillaryCapillaryCapillary
Active phase DB-WaxDB-WaxDB-WaxDB-WaxDB-Wax
Column length (m) 30.30.30.30.30.
Carrier gas H2H2HeHeHe
Substrate
Column diameter (mm) 0.320.320.250.250.25
Phase thickness (μm) 1.1.0.250.250.25
Tstart (C) 40.40.20.20.50.
Tend (C) 210.210.200.200.220.
Heat rate (K/min) 3.3.4.4.4.
Initial hold (min)   5.5.3.
Final hold (min)   10.10.20.
I 2420.2423.2420.2436.2387.
ReferenceMoio and Addeo, 1998Moio and Addeo, 1998Ott, Fay, et al., 1997Ott, Fay, et al., 1997Humpf and Schreier, 1991
Comment MSDC-RI MSDC-RI MSDC-RI MSDC-RI MSDC-RI
Column type CapillaryCapillaryCapillaryCapillaryCapillary
Active phase DB-WaxCP-Wax 58CBDB-WaxDB-WaxDB-Wax
Column length (m) 30.30.30.30.30.
Carrier gas HeHeHeHeHe
Substrate
Column diameter (mm) 0.250.250.2590.2590.259
Phase thickness (μm) 0.250.220.250.250.25
Tstart (C) 50.40.50.50.50.
Tend (C) 240.220.240.240.240.
Heat rate (K/min) 4.3.4.4.4.
Initial hold (min) 3. 3.3.3.
Final hold (min)
I 2420.2400.2391.2408.2392.
ReferenceKrammer, Winterhalter, et al., 1991Pabst, Barron, et al., 1991Suárez, Duque, et al., 1991Suárez, Duque, et al., 1991Suárez, Duque, et al., 1991
Comment MSDC-RI MSDC-RI MSDC-RI MSDC-RI MSDC-RI
Column type CapillaryCapillary
Active phase DB-WaxCarbowax 20M
Column length (m) 30.30.
Carrier gas HeHe
Substrate
Column diameter (mm) 0.2590.25
Phase thickness (μm) 0.250.25
Tstart (C) 50.40.
Tend (C) 240.240.
Heat rate (K/min) 4.4.
Initial hold (min) 3.3.
Final hold (min)
I 2408.2401.
ReferenceSuárez, Duque, et al., 1991Schwab, Mahr, et al., 1989
Comment MSDC-RI MSDC-RI

Lee's RI, non-polar column, custom temperature program

Data compiled by: NIST Mass Spectrometry Data Center, William E. Wallace, director

Column type CapillaryCapillaryCapillaryCapillaryCapillary
Active phase DB-5DB-5MSPolydimethyl siloxanesMethyl SiliconeMethyl Silicone
Column length (m) 60.60.
Carrier gas
Substrate
Column diameter (mm)  0.25
Phase thickness (μm)
Program not specifiednot specifiednot specifiednot specifiednot specified
I 195.8193.9196.52200.65202.69
ReferenceFuentes, Font, et al., 2007Aracil, Font, et al., 2005Eckel and Kind, 2003Eckel, Ross, et al., 1993Eckel, Ross, et al., 1993
Comment MSDC-RI MSDC-RI MSDC-RI MSDC-RI MSDC-RI

Van Den Dool and Kratz RI, non-polar column, custom temperature program

Data compiled by: NIST Mass Spectrometry Data Center, William E. Wallace, director

Column type Capillary
Active phase BPX-5
Column length (m) 50.
Carrier gas He
Substrate
Column diameter (mm) 0.32
Phase thickness (μm) 0.5
Program 0C (5min) => 40C/min => 40C (2min) => 10C/min => 280C
I 1185.
ReferenceElmore, Erbahadir, et al., 1997
Comment MSDC-RI

References

Stull D.R., 1969
Stull D.R., Jr.,
The Chemical Thermodynamics of Organic Compounds. Wiley, New York, 1969. [all data]
Ali N., 1983
Ali N.,
Thermodynamic functions of the benzoic acid, phthalic acid and salicylic acid,
Indian J. Phys., 1983, B57, 413-419. [all data]
Fujio, McIver, et al., 1981
Fujio, M.; McIver, R.T., Jr.; Taft, R.W.,
Effects on the acidities of phenols from specific substituent-solvent interactions. Inherent substituent parameters from gas phase acidities,
J. Am. Chem. Soc., 1981, 103, 4017. [all data]
Cumming and Kebarle, 1978
Cumming, J.B.; Kebarle, P.,
Summary of gas phase measurements involving acids AH. Entropy changes in proton transfer reactions involving negative ions. Bond dissociation energies D(A-H) and electron affinities EA(A),
Can. J. Chem., 1978, 56, 1. [all data]
Caldwell, Renneboog, et al., 1989
Caldwell, G.; Renneboog, R.; Kebarle, P.,
Gas Phase Acidities of Aliphatic Carboxylic Acids, Based on Measurements of Proton Transfer Equilibria,
Can. J. Chem., 1989, 67, 4, 661, https://doi.org/10.1139/v89-092
. [all data]
Paul and Kebarle, 1991
Paul, G.J.C.; Kebarle, P.,
Stabilities of Complexes of Br- with Substituted Benzenes (SB) Based on Determinations of the Gas-Phase Equilibria Br- + SB = (BrSB)-,
J. Am. Chem. Soc., 1991, 113, 4, 1148, https://doi.org/10.1021/ja00004a014
. [all data]
Moselhy and Pritchard, 1975
Moselhy, G.M.; Pritchard, H.O.,
The thermochemistry of the chloro-benzoyl chlorides,
J. Chem. Thermodyn., 1975, 7, 977-982. [all data]
Carson, Pritchard, et al., 1950
Carson, A.S.; Pritchard, H.O.; Skinner, H.A.,
The heats of hydrolysis of the benzoyl halides,
J. Chem. Soc., 1950, 656-659. [all data]
Davies, Dunning, et al., 1972
Davies, J.V.; Dunning, B.K.; Pritchard, H.O.,
The enthalpy of formation of benzoyl chloride,
J. Chem. Thermodyn., 1972, 4, 731-737. [all data]
Briner and Chastonay, 1954
Briner, E.; Chastonay, P.,
Etude thermochemique de l'autoxydation de Valdehyde benzoique,
Helv. Chim. Acta, 1954, 238, 539-541. [all data]
Cox and Pilcher, 1970
Cox, J.D.; Pilcher, G.,
Thermochemistry of Organic and Organometallic Compounds, Academic Press, New York, 1970, 1-636. [all data]
Guthrie and Cullimore, 1980
Guthrie, J.P.; Cullimore, P.A.,
Effect of the acyl substituent on the equilibrium constant for hydration of esters,
Can. J. Chem., 1980, 58, 1281-1294. [all data]
Hunter and Lias, 1998
Hunter, E.P.; Lias, S.G.,
Evaluated Gas Phase Basicities and Proton Affinities of Molecules: An Update,
J. Phys. Chem. Ref. Data, 1998, 27, 3, 413-656, https://doi.org/10.1063/1.556018
. [all data]
Klasinc, Kovac, et al., 1983
Klasinc, L.; Kovac, B.; Gusten, H.,
Photoelectron spectra of acenes. Electronic structure and substituent effects,
Pure Appl. Chem., 1983, 55, 289. [all data]
Meeks, Wahlborg, et al., 1981
Meeks, J.; Wahlborg, A.; McGlynn, S.P.,
Photoelectron spectroscopy of carbonyls: Benzoic acid and its derivatives,
J. Electron Spectrosc. Relat. Phenom., 1981, 22, 43. [all data]
Benoit, 1973
Benoit, F.,
Substituent effects in mass spectrometry. III. Substituent effects in the dissociation of the molecular ions of para and meta subtituted benzoic acids,
Org. Mass Spectrom., 1973, 7, 295. [all data]
Benoit, 1973, 2
Benoit, F.,
The benzoyl cation: The participation of isolated electronic excited states in the dissociation of molecular ions of the form [C6H5COX]+,
Org. Mass Spectrom., 1973, 7, 1407. [all data]
Foffani, Pignataro, et al., 1964
Foffani, A.; Pignataro, S.; Cantone, B.; Grasso, F.,
Ionization potentials and substituent effects for aromatic carbonyl compounds,
Z. Physik. Chem. (Frankfurt), 1964, 42, 221. [all data]
Tajima, Azami, et al., 1977
Tajima, S.; Azami, T.; Tsuchiya, T.,
An investigation of the decomposition of the common intermediate ions produced by electron impact,
Org. Mass Spectrom., 1977, 12, 24. [all data]