1,2-Dioxocane
- Formula: C6H12O2
- Molecular weight: 116.1583
- IUPAC Standard InChIKey: WXIXHCWLYVANJA-UHFFFAOYSA-N
- CAS Registry Number: 6572-89-0
- Chemical structure:
View 3d structure (requires JavaScript / HTML 5) - Permanent link for this species. Use this link for bookmarking this species for future reference.

Gas phase ion energetics data

Data compiled as indicated in comments:
LLK - Sharon G. Lias, Rhoda D. Levin, and Sherif A. Kafafi
Ionization energy determinations
IE (eV) | Method | Reference | Comment |
---|---|---|---|
9.29 | PE | Coughlin, Brown, et al., 1979 | Vertical value; LLK |

References

Coughlin, Brown, et al., 1979
Coughlin, D.J.; Brown, R.S.; Salomon, R.G.,
The prostaglandin endoperoxide nucleus and related bicyclic peroxides. Synthetic and spectroscopic studies,
J. Am. Chem. Soc., 1979, 101, 1533. [all data]