CF3H(cyc-CCS)

Vibrational and/or electronic energy levels

Data compiled by: Marilyn E. Jacox

State:   X

Vib.
sym.
 No.   Approximate
 type of mode
 cm-1   Med.   Method   References

CH stretch 3210 w Ar IR Torres, Clement, et al., 1978
1240 s Ar IR Torres, Clement, et al., 1978
1190 s Ar IR Torres, Clement, et al., 1978
1180 s Ar IR Torres, Clement, et al., 1978
720 w Ar IR Torres, Clement, et al., 1978

Additional references: Jacox, 1994, page 381

References

Torres, Clement, et al., 1978
Torres, M.; Clement, A.; Bertie, J.E.; Gunning, H.E.; Strausz, O.P., Low-temperature matrix isolation of thiirenes, J. Org. Chem., 1978, 43, 12, 2490, https://doi.org/10.1021/jo00406a045 . [all data]

Jacox, 1994
Jacox, M.E., Vibrational and electronic energy levels of polyatomic transient molecules, American Chemical Society, Washington, DC, 1994, 464. [all data]