Hydrocinnamic acid, p-methoxy-β-methyl-, methyl ester
- Formula: C12H16O3
- Molecular weight: 208.2536
- IUPAC Standard InChIKey: QEMGSNIRBXNNJW-UHFFFAOYSA-N
- CAS Registry Number: 6555-29-9
- Chemical structure:
View 3d structure (requires JavaScript / HTML 5) - Other names: 3-(4-Methoxyphenyl)butanoic acid methyl ester

Gas phase ion energetics data

Data compiled by: Henry M. Rosenstock, Keith Draxl, Bruce W. Steiner, and John T. Herron
Ionization energy determinations
IE (eV) | Method | Reference |
---|---|---|
7.7 ± 0.2 | EI | Howe, Williams, et al., 1969 |
Appearance energy determinations
Ion | AE (eV) | Other Products | Method | Reference | Comment |
---|---|---|---|---|---|
C9H11O+ | 10.6 ± 0.2 | ? | EI | Howe, Williams, et al., 1969 | |
C10H12O+ | 10.2 ± 0.2 | ? | EI | Howe, Williams, et al., 1969 |

References

Howe, Williams, et al., 1969
Howe, I.; Williams, D.H.; Kingston, D.G.I.; Tannenbaum, H.P.,
Substituent effects in the mass spectra of some - and -substituted methyl butyrates,
J. Chem. Soc. B, 1969, 439. [all data]