Cyclobutane, 1,2-diethenyl-, trans-
- Formula: C8H12
- Molecular weight: 108.1809
- IUPAC Standard InChIKey: UHHCYAAVGADGGP-HTQZYQBOSA-N
- CAS Registry Number: 6553-48-6
- Chemical structure:
View 3d structure (requires JavaScript / HTML 5) - Stereoisomers:
- Other names: Cyclobutane, 1,2-divinyl-, trans-; trans-1,2-Divinylcyclobutane; trans-1,2-Diethenyl-cyclobutane; Cyclobutane,trans-1,2-diethenyl-; (E)-1,2-Divinylcyclobutane

Gas phase thermochemistry data

Data compiled by: Hussein Y. Afeefy, Joel F. Liebman, and Stephen E. Stein
Quantity | Value | Units | Method | Reference | Comment |
---|---|---|---|---|---|
ΔfH°gas | 177. | kJ/mol | Chyd | Roth, Adamczak, et al., 1991 |

Condensed phase thermochemistry data

Data compiled by: Hussein Y. Afeefy, Joel F. Liebman, and Stephen E. Stein
Quantity | Value | Units | Method | Reference | Comment |
---|---|---|---|---|---|
ΔcH°liquid | -4964.3 | kJ/mol | Ccr | Rauh, Geyer, et al., 1973 | Corresponding ΔfHºliquid = 101. kJ/mol (simple calculation by NIST; no Washburn corrections) |

Phase change data

Data compiled as indicated in comments:
BS - Robert L. Brown and Stephen E. Stein
AC - William E. Acree, Jr., James S. Chickos
ALS - Hussein Y. Afeefy, Joel F. Liebman, and Stephen E. Stein
Quantity | Value | Units | Method | Reference | Comment |
---|---|---|---|---|---|
Tboil | 385.7 | K | N/A | Weast and Grasselli, 1989 | BS |
Quantity | Value | Units | Method | Reference | Comment |
ΔvapH° | 38.9 ± 0.5 | kJ/mol | EB | Varushchenko, Pashchenko, et al., 1996 | Based on data from 319. to 371. K.; AC |
ΔvapH° | 42.3 | kJ/mol | N/A | Rauh, Geyer, et al., 1973, 2 | AC |
ΔvapH° | 42.26 | kJ/mol | V | Rauh, Geyer, et al., 1973 | ALS |
Enthalpy of vaporization
ΔvapH (kJ/mol) | Temperature (K) | Method | Reference | Comment |
---|---|---|---|---|
39.1 | 365. | A | Stephenson and Malanowski, 1987 | Based on data from 350. to 385. K.; AC |
39.0 ± 0.5 | 367. | N/A | Rauh, Geyer, et al., 1973, 2 | AC |

Reaction thermochemistry data

Data compiled by: Hussein Y. Afeefy, Joel F. Liebman, and Stephen E. Stein
Individual Reactions
By formula: 2H2 + C8H12 = C8H16
Quantity | Value | Units | Method | Reference | Comment |
---|---|---|---|---|---|
ΔrH° | -232. ± 0.8 | kJ/mol | Chyd | Roth, Adamczak, et al., 1991 | liquid phase |

Gas phase ion energetics data

Data compiled as indicated in comments:
LLK - Sharon G. Lias, Rhoda D. Levin, and Sherif A. Kafafi
Ionization energy determinations
IE (eV) | Method | Reference | Comment |
---|---|---|---|
9.20 | PE | Bischof, Gleiter, et al., 1981 | Vertical value; LLK |

References

Roth, Adamczak, et al., 1991
Roth, W.R.; Adamczak, O.; Breuckmann, R.; Lennartz, H.-W.; Boese, R.,
Die Berechnung von Resonanzenergien; das MM2ERW-Kraftfeld,
Chem. Ber., 1991, 124, 2499-2521. [all data]
Rauh, Geyer, et al., 1973
Rauh, H.J.; Geyer, W.; Schmidt, H.; Geiseler, G.,
Bildungsenthalpien und mesomerieenergien von π-bindungssystemen,
Z. Phys. Chem. (Leipzig), 1973, 253, 43-48. [all data]
Weast and Grasselli, 1989
CRC Handbook of Data on Organic Compounds, 2nd Editon, Weast,R.C and Grasselli, J.G., ed(s)., CRC Press, Inc., Boca Raton, FL, 1989, 1. [all data]
Varushchenko, Pashchenko, et al., 1996
Varushchenko, R.M.; Pashchenko, L.L.; Druzhinina, A.I.,
Enthalpies of vaporization of some mono- and polycyclic hydrocarbons,
Zh. Fiz. Khim., 1996, 70, 2, 228. [all data]
Rauh, Geyer, et al., 1973, 2
Rauh, H.-J.; Geyer, W.; Schmidt, H.; Geiseler, G.,
Z. Phys. Chem. (Leipzig), 1973, 253, 43. [all data]
Stephenson and Malanowski, 1987
Stephenson, Richard M.; Malanowski, Stanislaw,
Handbook of the Thermodynamics of Organic Compounds, 1987, https://doi.org/10.1007/978-94-009-3173-2
. [all data]
Bischof, Gleiter, et al., 1981
Bischof, P.; Gleiter, R.; Gubernator, K.; Haider, R.; Musso, H.; Schwarz, W.; Trautmann, W.; Hopf, H.,
Photoelectronen-spektroskopische untersuchungen an divinylcyclobutanen,
Chem. Ber., 1981, 114, 994. [all data]