Pentafluorobenzaldehyde
- Formula: C7HF5O
- Molecular weight: 196.0743
- IUPAC Standard InChIKey: QJXCFMJTJYCLFG-UHFFFAOYSA-N
- CAS Registry Number: 653-37-2
- Chemical structure:
View 3d structure (requires JavaScript / HTML 5) - Other names: 2,3,4,5,6-Pentafluorobenzaldehyde; Benzaldehyde, pentafluoro-; Benzaldehyde, 2,3,4,5,6-pentafluoro-

Phase change data

Data compiled by: Robert L. Brown and Stephen E. Stein
Quantity | Value | Units | Method | Reference | Comment |
---|---|---|---|---|---|
Tboil | 437. to 439. | K | N/A | Farchan Laboratories, 1990 | |
Tboil | 437. to 439. | K | N/A | PCR Inc., 1990 | |
Tboil | 438.2 | K | N/A | Weast and Grasselli, 1989 |

Gas phase ion energetics data

Data compiled as indicated in comments:
LL - Sharon G. Lias and Joel F. Liebman
RDSH - Henry M. Rosenstock, Keith Draxl, Bruce W. Steiner, and John T. Herron
B - John E. Bartmess
Electron affinity determinations
EA (eV) | Method | Reference | Comment |
---|---|---|---|
1.10 ± 0.11 | IMRE | Dillow and Kebarle, 1989 | ΔGea(423 K) = -26.8±1.0 kcal/mol , assumed entropy = 3.5 eu; B |
Ionization energy determinations
IE (eV) | Method | Reference | Comment |
---|---|---|---|
10.35 | PE | Furin, Zibarev, et al., 1989 | Vertical value; LL |
Appearance energy determinations
Ion | AE (eV) | Other Products | Method | Reference | Comment |
---|---|---|---|---|---|
C7OF5+ | 11.6 | H | EI | Majer and Patrick, 1963 | RDSH |

Normal alkane RI, non-polar column, custom temperature program

Column type | Active phase | I | Reference | Comment |
---|---|---|---|---|
Capillary | Polydimethyl siloxanes | 943. | Zenkevich, 2001 | Program: not specified |

References

Farchan Laboratories, 1990
Farchan Laboratories,
Research Chemicals Catalog, Farchan Laboratories, Gainesville, FL, 1990, 91. [all data]
PCR Inc., 1990
PCR Inc.,
Research Chemicals Catalog 1990-1991, PCR Inc., Gainesville, FL, 1990, 1. [all data]
Weast and Grasselli, 1989
CRC Handbook of Data on Organic Compounds, 2nd Editon, Weast,R.C and Grasselli, J.G., ed(s)., CRC Press, Inc., Boca Raton, FL, 1989, 1. [all data]
Dillow and Kebarle, 1989
Dillow, G.W.; Kebarle, P.,
Substituent Effects on the Electron Affinities of Perfluorobenzenes C6F5X,
J. Am. Chem. Soc., 1989, 111, 15, 5592, https://doi.org/10.1021/ja00197a014
. [all data]
Furin, Zibarev, et al., 1989
Furin, G.G.; Zibarev, A.V.; Sultanov, A.Sh.; Furlei, I.I.,
Order and structure of the outer valence Mo's of some derivatives of pentafluorobenzene,
Bull. Acad. Sci. USSR, Div. Chem. Sci., 1989, 4, 772. [all data]
Majer and Patrick, 1963
Majer, J.R.; Patrick, C.R.,
Appearance potentials of the benzoyl radical-ion,
J. Chem. Soc. Faraday Trans., 1963, 59, 1274. [all data]
(editor), 1967
(editor), Koptyug V.A.,
Atlas of Spectra of Aromatic and Heterocyclic Compounds, 1967, 1, 90. [all data]
Zenkevich, 2001
Zenkevich, I.G.,
Encyclopedia of Chromatography. Derivatization of Amines, Amino Acids, Amides and Imides for GC Analysis, Marcel Dekker, Inc, New York - Basel, 2001, 224. [all data]