Benzene, ethenylpentafluoro-
- Formula: C8H3F5
- Molecular weight: 194.1014
- IUPAC Standard InChIKey: LVJZCPNIJXVIAT-UHFFFAOYSA-N
- CAS Registry Number: 653-34-9
- Chemical structure:
View 3d structure (requires JavaScript / HTML 5) - Other names: Pentafluorostyrene; 2,3,4,5,6-Pentafluorostyrene; Styrene, 2,3,4,5,6-pentafluoro-; Vinylpentafluorobenzene

Phase change data

Data compiled by: Robert L. Brown and Stephen E. Stein
Quantity | Value | Units | Method | Reference | Comment |
---|---|---|---|---|---|
Tboil | 412. to 413. | K | N/A | PCR Inc., 1990 |
Reduced pressure boiling point
Tboil (K) | Pressure (bar) | Reference |
---|---|---|
335.7 | 0.067 | Aldrich Chemical Company Inc., 1990 |

Gas phase ion energetics data

Data compiled as indicated in comments:
LLK - Sharon G. Lias, Rhoda D. Levin, and Sherif A. Kafafi
Ionization energy determinations
IE (eV) | Method | Reference | Comment |
---|---|---|---|
9.18 ± 0.02 | PE | Maier and Turner, 1973 | LLK |

References

PCR Inc., 1990
PCR Inc.,
Research Chemicals Catalog 1990-1991, PCR Inc., Gainesville, FL, 1990, 1. [all data]
Aldrich Chemical Company Inc., 1990
Aldrich Chemical Company Inc.,
Catalog Handbook of Fine Chemicals, Aldrich Chemical Company, Inc., Milwaukee WI, 1990, 1. [all data]
Maier and Turner, 1973
Maier, J.P.; Turner, D.W.,
Steric inhibition of resonance studied by molecular photoelectron spectroscopy. Part 2. Phenylethylenes,
J. Chem. Soc. Faraday Trans. 2, 1973, 69, 196. [all data]