Tricyclo[8.2.2.24,7]hexadeca-4,6,10,12,13,15-hexaene,5,6,15,16-tetramethyl-
- Formula: C20H24
- Molecular weight: 264.4046
- IUPAC Standard InChIKey: PYYCSJUCOFSFBP-UHFFFAOYSA-N
- CAS Registry Number: 65304-59-8
- Chemical structure:
View 3d structure (requires JavaScript / HTML 5) - Permanent link for this species. Use this link for bookmarking this species for future reference.

Gas phase ion energetics data

Data compiled by: Sharon G. Lias, Rhoda D. Levin, and Sherif A. Kafafi
Ionization energy determinations
IE (eV) | Method | Reference | Comment |
---|---|---|---|
7.47 | PE | Kovac, Mohraz, et al., 1980 | Vertical value |
7.55 | PE | Kovac, Allan, et al., 1980 | Vertical value |

References

Kovac, Mohraz, et al., 1980
Kovac, B.; Mohraz, M.; Heilbronner, E.; Boekelheide, V.; Hopf, H.,
Photoelectron spectra of the cyclophanes,
J. Am. Chem. Soc., 1980, 102, 4314. [all data]
Kovac, Allan, et al., 1980
Kovac, B.; Allan, M.; Heilbronner, E.; Maier, J.P.; Gleiter, R.; Haenel, M.W.; Keehn, P.M.; Reiss, J.A.,
He(Iα) photoelectron spectra of [2.2]cyclophanes,
J. Electron Spectrosc. Relat. Phenom., 1980, 19, 167. [all data]