Benzene, 1-(2-bromoethyl)-4-chloro-
- Formula: C8H8BrCl
- Molecular weight: 219.506
- IUPAC Standard InChIKey: YAFMYKFAUNCQPU-UHFFFAOYSA-N
- CAS Registry Number: 6529-53-9
- Chemical structure:
View 3d structure (requires JavaScript / HTML 5) - Other names: p-Chloro-β-phenethyl bromide; p-Chlorophenethyl bromide; 1-(2-Bromoethyl)-4-chlorobenzene; 2-(p-Chlorophenyl)ethyl bromide; 4-Chlorophenethyl bromide; 1-Bromo-2-(4-chlorophenyl)ethane

Gas phase ion energetics data

Data compiled by: Henry M. Rosenstock, Keith Draxl, Bruce W. Steiner, and John T. Herron
Ionization energy determinations
IE (eV) | Method | Reference |
---|---|---|
8.8 | EI | Grutzmacher, 1970 |
Appearance energy determinations
Ion | AE (eV) | Other Products | Method | Reference | Comment |
---|---|---|---|---|---|
C8H8Cl+ | 10.1 | Br | EI | Grutzmacher, 1970 |

References

Grutzmacher, 1970
Grutzmacher, H.-F.,
Zum Mechanismus massenspektrometrischer Fragmentierungsreaktionen-IV: zur Bildung von Phenonium-Ionen bei der Elektronenstoss-Fragmentierung von -Phenylathylbromiden,
Org. Mass Spectrom., 1970, 3, 131. [all data]