Acetophenone, octafluoro-
- Formula: C8F8O
- Molecular weight: 264.0722
- IUPAC Standard InChIKey: IIDKLGQPNPUKBQ-UHFFFAOYSA-N
- CAS Registry Number: 652-22-2
- Chemical structure:
View 3d structure (requires JavaScript / HTML 5) - Permanent link for this species. Use this link for bookmarking this species for future reference.

Gas phase ion energetics data

Data compiled as indicated in comments:
LL - Sharon G. Lias and Joel F. Liebman
RDSH - Henry M. Rosenstock, Keith Draxl, Bruce W. Steiner, and John T. Herron
Ionization energy determinations
IE (eV) | Method | Reference | Comment |
---|---|---|---|
11.05 | EI | Majer and Patrick, 1963 | RDSH |
10.56 | PE | Furin, Zibarev, et al., 1989 | Vertical value; LL |
Appearance energy determinations
Ion | AE (eV) | Other Products | Method | Reference | Comment |
---|---|---|---|---|---|
C6F5+ | 16.0 | ? | EI | Majer and Patrick, 1963 | RDSH |
C7OF5+ | 11.15 | ? | EI | Majer and Patrick, 1963 | RDSH |

References

Majer and Patrick, 1963
Majer, J.R.; Patrick, C.R.,
Appearance potentials of the benzoyl radical-ion,
J. Chem. Soc. Faraday Trans., 1963, 59, 1274. [all data]
Furin, Zibarev, et al., 1989
Furin, G.G.; Zibarev, A.V.; Sultanov, A.Sh.; Furlei, I.I.,
Order and structure of the outer valence Mo's of some derivatives of pentafluorobenzene,
Bull. Acad. Sci. USSR, Div. Chem. Sci., 1989, 4, 772. [all data]