Benzene, 1,2,4,5-tetrafluoro-3,6-bis(trifluoromethyl)-
- Formula: C8F10
- Molecular weight: 286.0696
- IUPAC Standard InChIKey: WWZNHODBHBVRID-UHFFFAOYSA-N
- CAS Registry Number: 651-89-8
- Chemical structure:
View 3d structure (requires JavaScript / HTML 5) - Other names: Decafluoro-p-xylol

Gas phase ion energetics data

Data compiled by: Sharon G. Lias, Rhoda D. Levin, and Sherif A. Kafafi
Ionization energy determinations
IE (eV) | Method | Reference | Comment |
---|---|---|---|
9.9 | PE | Maier, Marthaler, et al., 1980 | Vertical value |

Van Den Dool and Kratz RI, non-polar column, temperature ramp

Column type | Active phase | I | Reference | Comment |
---|---|---|---|---|
Capillary | OV-1 | 636.1 | Gautzsch and Zinn, 1996 | 8. K/min; Tstart: 35. C; Tend: 300. C |
Capillary | OV-1 | 636.1 | Gautzsch and Zinn, 1996 | 8. K/min; Tstart: 35. C; Tend: 300. C |

References

Maier, Marthaler, et al., 1980
Maier, J.P.; Marthaler, O.; Mohraz, M.,
Decay of some substituted benzene cations in the B states in the gaseous phase,
J. Chim. Phys., 1980, 77, 661. [all data]
Gautzsch and Zinn, 1996
Gautzsch, R.; Zinn, P.,
Use of incremental models to estimate the retention indexes of aromatic compounds,
Chromatographia, 1996, 43, 3/4, 163-176, https://doi.org/10.1007/BF02292946
. [all data]