Ethanone,2,2,2-trifluoro-1-(2-thienyl)-
- Formula: C6H3F3OS
- Molecular weight: 180.148
- IUPAC Standard InChIKey: CZYKJGCKVBXLGF-UHFFFAOYSA-N
- CAS Registry Number: 651-70-7
- Chemical structure:
View 3d structure (requires JavaScript / HTML 5) - Other names: 2-(Trifluoroacetyl)thiophene

Gas phase ion energetics data

Data compiled by: Sharon G. Lias, Rhoda D. Levin, and Sherif A. Kafafi
Ionization energy determinations
IE (eV) | Method | Reference |
---|---|---|
9.70 ± 0.05 | EI | Linda, Marino, et al., 1971 |

References

Linda, Marino, et al., 1971
Linda, P.; Marino, G.; Pignataro, S.,
A comparison of sensitivities to substituent effects of five- membered heteroaromatic rings in gas phase ionization,
J. Chem. Soc. B, 1971, 1585. [all data]