2-Cyclohexenone,3-cyano,5,5-dimethyl-
- Formula: C9H11NO
- Molecular weight: 149.1897
- IUPAC Standard InChIKey: HKYRXDYNQOWCBK-UHFFFAOYSA-N
- CAS Registry Number: 65115-71-1
- Chemical structure:
View 3d structure (requires JavaScript / HTML 5) - Permanent link for this species. Use this link for bookmarking this species for future reference.

Gas phase ion energetics data

Data compiled as indicated in comments:
LBLHLM - Sharon G. Lias, John E. Bartmess, Joel F. Liebman, John L. Holmes, Rhoda D. Levin, and W. Gary Mallard
Ionization energy determinations
IE (eV) | Method | Reference | Comment |
---|---|---|---|
9.72 | PE | Pfister-Guillouzo, Geribaldi, et al., 1982 | Vertical value; LBLHLM |

References

Pfister-Guillouzo, Geribaldi, et al., 1982
Pfister-Guillouzo, G.; Geribaldi, S.; Gal, J.-F.,
Spectres photoelectroniques de cyclohexene-2-ones-1 diversement substituees en position 3. Correlations avec la reactivite,
Can. J. Chem., 1982, 60, 1163. [all data]