Phosphinous chloride, bis(trifluoromethyl)-
- Formula: C2ClF6P
- Molecular weight: 204.439
- IUPAC Standard InChIKey: SLPNGGHOLGPULH-UHFFFAOYSA-N
- CAS Registry Number: 650-52-2
- Chemical structure:
View 3d structure (requires JavaScript / HTML 5) - Permanent link for this species. Use this link for bookmarking this species for future reference.

Phase change data

Data compiled by: William E. Acree, Jr., James S. Chickos
Enthalpy of vaporization
ΔvapH (kJ/mol) | Temperature (K) | Reference | Comment |
---|---|---|---|
27.8 | 258. | Peterson and Burg, 1964 | Based on data from 193. to 273. K. See also Boublik, Fried, et al., 1984. |

Gas phase ion energetics data

Data compiled by: Sharon G. Lias, Rhoda D. Levin, and Sherif A. Kafafi
Ionization energy determinations
IE (eV) | Method | Reference | Comment |
---|---|---|---|
11.13 | PE | Cowley, Dewar, et al., 1975 | Vertical value |
11.13 | PE | Cowley, Dewar, et al., 1974 | Vertical value |

References

Peterson and Burg, 1964
Peterson, Louis K.; Burg, Anton B.,
Acetoxyphosphines,
J. Am. Chem. Soc., 1964, 86, 13, 2587-2591, https://doi.org/10.1021/ja01067a014
. [all data]
Boublik, Fried, et al., 1984
Boublik, T.; Fried, V.; Hala, E.,
The Vapour Pressures of Pure Substances: Selected Values of the Temperature Dependence of the Vapour Pressures of Some Pure Substances in the Normal and Low Pressure Region, 2nd ed., Elsevier, New York, 1984, 972. [all data]
Cowley, Dewar, et al., 1975
Cowley, A.H.; Dewar, M.J.S.; Goodman, D.W.,
Molecular photoelectron spectroscopic studies of some trifluoromethyl-substituted phosphines and chlorophosphines,
J. Am. Chem. Soc., 1975, 97, 3653. [all data]
Cowley, Dewar, et al., 1974
Cowley, A.H.; Dewar, M.J.S.; Gilje, J.W.; Goodman, D.W.; Schweiger, J.R.,
Relationship between the photoelectron spectra and torsional barriers of aminophosphines,
J. Chem. Soc., Chem. Commun., 1974, 340. [all data]