Benzene, (1-methyl-2-cyclopropen-1-yl)-
- Formula: C10H10
- Molecular weight: 130.1864
- IUPAC Standard InChIKey: QPQKDBYTARBUDX-UHFFFAOYSA-N
- CAS Registry Number: 65051-83-4
- Chemical structure:
View 3d structure (requires JavaScript / HTML 5) - Other names: 3-Methyl-3-phenylcyclopropene; 1-Cyclopropene, 3-methyl-3-phenyl-; 1-Methyl-1-phenyl-2-cyclopropene

Gas phase ion energetics data

Data compiled as indicated in comments:
LBLHLM - Sharon G. Lias, John E. Bartmess, Joel F. Liebman, John L. Holmes, Rhoda D. Levin, and W. Gary Mallard
Ionization energy determinations
IE (eV) | Method | Reference | Comment |
---|---|---|---|
8.29 | PI | Domnin, Lakshin, et al., 1985 | LBLHLM |
8.2 | PE | Baidin, Domnin, et al., 1984 | LBLHLM |
8.49 | PE | Baidin, Domnin, et al., 1984 | Vertical value; LBLHLM |
Appearance energy determinations
Ion | AE (eV) | Other Products | Method | Reference | Comment |
---|---|---|---|---|---|
C9H7+ | 8.75 | CH3 | PI | Domnin, Lakshin, et al., 1985 | LBLHLM |

References

Domnin, Lakshin, et al., 1985
Domnin, I.N.; Lakshin, A.M.; Misharev, A.D.; Orlov, V.M.; Takhistov, V.V.,
Thermochemical investigation of some hydrocarbon ions generated by photoionization,
J. Org. Chem. USSR, 1985, 21, 1149. [all data]
Baidin, Domnin, et al., 1984
Baidin, V.N.; Domnin, I.N.; Prokhorenko, O.A.; Elbel, S.; de Meijere, A.,
Photoelectron spectra of phenyl substituted cyclopropene derivatives,
J. Electron Spectrosc. Relat. Phenom., 1984, 34, 103. [all data]