Chromium,pentacarbonyl[1-(4-pyridinyl)ethanone-N]-
- Formula: C12H7CrNO6
- Molecular weight: 313.1832
- CAS Registry Number: 64914-29-0

Gas phase ion energetics data

Data compiled by: Sharon G. Lias, Rhoda D. Levin, and Sherif A. Kafafi
Ionization energy determinations
IE (eV) | Method | Reference | Comment |
---|---|---|---|
7.5 | PI | Weiner, Gin, et al., 1977 | Vertical value |

References

Weiner, Gin, et al., 1977
Weiner, M.A.; Gin, A.; Lattman, M.,
Ultraviolet photoelectron spectra of 4-substituted pyridine- pentacarbonylchromium complexes,
Inorg. Chim. Acta, 1977, 24, 235. [all data]