Chromium,pentacarbonyl(4-methylpyridine)-(OC-6-22)-
- Formula: C11H7CrNO5
- Molecular weight: 285.1731
- IUPAC Standard InChIKey: LRBGZHFJBVJLCM-UHFFFAOYSA-N
- CAS Registry Number: 64914-26-7
- Chemical structure:

Gas phase ion energetics data

Data compiled by: Sharon G. Lias, Rhoda D. Levin, and Sherif A. Kafafi
Ionization energy determinations
IE (eV) | Method | Reference | Comment |
---|---|---|---|
7.22 | PE | Weiner, Gin, et al., 1977 | Vertical value |

References

Weiner, Gin, et al., 1977
Weiner, M.A.; Gin, A.; Lattman, M.,
Ultraviolet photoelectron spectra of 4-substituted pyridine- pentacarbonylchromium complexes,
Inorg. Chim. Acta, 1977, 24, 235. [all data]