Chromium,pentacarbonyl[4-(1,1-dimethylethyl)pyridine]-
- Formula: C14H13CrNO5
- Molecular weight: 327.2528
- CAS Registry Number: 64914-25-6

Gas phase ion energetics data

Data compiled by: Sharon G. Lias, Rhoda D. Levin, and Sherif A. Kafafi
Ionization energy determinations
IE (eV) | Method | Reference | Comment |
---|---|---|---|
7.17 | PE | Weiner, Gin, et al., 1977 | Vertical value |

References

Weiner, Gin, et al., 1977
Weiner, M.A.; Gin, A.; Lattman, M.,
Ultraviolet photoelectron spectra of 4-substituted pyridine- pentacarbonylchromium complexes,
Inorg. Chim. Acta, 1977, 24, 235. [all data]