Ge3 anion
- Formula: Ge3-
- Molecular weight: 217.92
- CAS Registry Number: 64886-43-7

Ion clustering data

Data compiled by: John E. Bartmess
Clustering reactions
By formula: (Ge3- • 4294967295Ge) + Ge = Ge3-
Quantity | Value | Units | Method | Reference | Comment |
---|---|---|---|---|---|
ΔrH° | 386. ± 10. | kJ/mol | N/A | Burton, Xu, et al., 1996 | gas phase |

Vibrational and/or electronic energy levels

Data compiled by: Marilyn E. Jacox
State: ?
Energy (cm-1) |
Med. | Transition | λmin (nm) |
λmax (nm) |
References | ||
---|---|---|---|---|---|---|---|
Td = 17990 ± 80 | gas | Burton, Xu, et al., 1996 | |||||
State: X
Vib. sym. |
No. | Approximate type of mode |
cm-1 | Med. | Method | References | |
---|---|---|---|---|---|---|---|
290 | T | gas | PE | Burton, Xu, et al., 1996 | |||
Additional references: Jacox, 1998, page 173

Gas phase thermochemistry data

Data compiled by: John E. Bartmess
Quantity | Value | Units | Method | Reference | Comment |
---|---|---|---|---|---|
ΔfH°gas | 257.2 ± 2.3 | kJ/mol | R-EA | Burton, Xu, et al., 1996 |

Reaction thermochemistry data

Data compiled by: John E. Bartmess
Individual Reactions
By formula: (Ge3- • 4294967295Ge) + Ge = Ge3-
Quantity | Value | Units | Method | Reference | Comment |
---|---|---|---|---|---|
ΔrH° | 386. ± 10. | kJ/mol | N/A | Burton, Xu, et al., 1996 | gas phase |

References

Burton, Xu, et al., 1996
Burton, G.R.; Xu, C.; Arnold, C.C.; Neumark, D.M.,
Photoelectron Spectroscopy and Zero Kinetic Energy Spectroscopy of Germanium Cluster Anions,
J. Chem. Phys., 1996, 104, 8, 2757, https://doi.org/10.1063/1.471098
. [all data]
Jacox, 1998
Jacox, M.E.,
Vibrational and electronic energy levels of polyatomic transient molecules: supplement A,
J. Phys. Chem. Ref. Data, 1998, 27, 2, 115-393, https://doi.org/10.1063/1.556017
. [all data]