1,3,5,2,4,6-Trithiatriazinyl radical
- Formula: N3S3
- Molecular weight: 138.215
- IUPAC Standard InChIKey: AXFGIDLAEBJHFK-UHFFFAOYSA-N
- CAS Registry Number: 64885-69-4
- Chemical structure:
View 3d structure (requires JavaScript / HTML 5) - Information on this page:

Gas phase ion energetics data

Data compiled by: Sharon G. Lias, John E. Bartmess, Joel F. Liebman, John L. Holmes, Rhoda D. Levin, and W. Gary Mallard
Ionization energy determinations
IE (eV) | Method | Reference | Comment |
---|---|---|---|
8.3 | PE | Lau, Westwood, et al., 1985 | |
8.62 | PE | Lau, Westwood, et al., 1986 | Vertical value |

References

Lau, Westwood, et al., 1985
Lau, W.M.; Westwood, N.P.C.; Palmer, M.H.,
A photoelectron/photoionisation and Ab initio study of the S3N3 radical produced by vaporisation of (SN)x,
J. Chem. Soc., Chem. Commun., 1985, 752. [all data]
Lau, Westwood, et al., 1986
Lau, W.M.; Westwood, N.P.C.; Palmer, M.H.,
Vaporization of (SN)x: He I photoelectron spectrum and ab initio calculations for the S3N3 radical,
J. Am. Chem. Soc., 1986, 108, 3229. [all data]