UH2

Vibrational and/or electronic energy levels

Data compiled by: Marilyn E. Jacox

State:   X

Vib.
sym.
 No.   Approximate
 type of mode
 cm-1   Med.   Method   References

a1 1 Sym. stretch 1406.1 Ar IR Souter, Kushto, et al., 1997
1 Sym. stretch 1399.0 Ar IR Souter, Kushto, et al., 1997
1 Sym. stretch 1392.2 Ar IR Souter, Kushto, et al., 1997
b2 3 Asym. stretch 1370.7 Ar IR Souter, Kushto, et al., 1997
3 Asym. stretch 1365.3 Ar IR Souter, Kushto, et al., 1997
3 Asym. stretch 1360.6 Ar IR Souter, Kushto, et al., 1997

Additional references: Jacox, 1998, page 128

References

Souter, Kushto, et al., 1997
Souter, P.F.; Kushto, G.P.; Andrews, L.; Neurock, M., Experimental and Theoretical Evidence for the Formation of Several Uranium Hydride Molecules, J. Am. Chem. Soc., 1997, 119, 7, 1682, https://doi.org/10.1021/ja9630809 . [all data]

Jacox, 1998
Jacox, M.E., Vibrational and electronic energy levels of polyatomic transient molecules: supplement A, J. Phys. Chem. Ref. Data, 1998, 27, 2, 115-393, https://doi.org/10.1063/1.556017 . [all data]