9-Ethoxyanthracene
- Formula: C16H14O
- Molecular weight: 222.2818
- IUPAC Standard InChIKey: LSOHZXVUUOEOTL-UHFFFAOYSA-N
- CAS Registry Number: 6487-28-1
- Chemical structure:
View 3d structure (requires JavaScript / HTML 5) - Permanent link for this species. Use this link for bookmarking this species for future reference.

Gas phase ion energetics data

Data compiled by: Henry M. Rosenstock, Keith Draxl, Bruce W. Steiner, and John T. Herron
Ionization energy determinations
IE (eV) | Method | Reference |
---|---|---|
7.44 | EI | Gillis, Long, et al., 1968 |
Appearance energy determinations
Ion | AE (eV) | Other Products | Method | Reference | Comment |
---|---|---|---|---|---|
C14H10O+ | 9.86 | C2H4 | EI | Gillis, Long, et al., 1968 |

References

Gillis, Long, et al., 1968
Gillis, R.G.; Long, G.J.; Moritz, A.G.; Occolowitz, J.L.,
Energetics of the electron-impact fragmentation of alkoxybenzenes and alkylthiobenzenes,
Org. Mass Spectrom., 1968, 1, 527. [all data]