Triisopropylsilane
- Formula: C9H22Si
- Molecular weight: 158.3565
- IUPAC Standard InChIKey: YDJXDYKQMRNUSA-UHFFFAOYSA-N
- CAS Registry Number: 6485-79-6
- Chemical structure:
View 3d structure (requires JavaScript / HTML 5) - Other names: Silane, tris(1-methylethyl)-

Phase change data

Data compiled by: Robert L. Brown and Stephen E. Stein
Reduced pressure boiling point
Tboil (K) | Pressure (bar) | Reference |
---|---|---|
358. | 0.047 | Farchan Laboratories, 1990 |

Gas phase ion energetics data

Data compiled by: Sharon G. Lias, Rhoda D. Levin, and Sherif A. Kafafi
Ionization energy determinations
IE (eV) | Method | Reference | Comment |
---|---|---|---|
9.5 | PE | Beltram, Fehlner, et al., 1980 | Vertical value |

References

Farchan Laboratories, 1990
Farchan Laboratories,
Research Chemicals Catalog, Farchan Laboratories, Gainesville, FL, 1990, 91. [all data]
Beltram, Fehlner, et al., 1980
Beltram, G.; Fehlner, T.P.; Mochida, K.; Kochi, J.K.,
UV photoelectron spectra of group IV alkyl hydrides,
J. Electron Spectrosc. Relat. Phenom., 1980, 18, 153. [all data]