(-)-Carvone
- Formula: C10H14O
- Molecular weight: 150.2176
- IUPAC Standard InChIKey: ULDHMXUKGWMISQ-VIFPVBQESA-N
- CAS Registry Number: 6485-40-1
- Chemical structure:
View 3d structure (requires JavaScript / HTML 5) - Stereoisomers:
- Other names: 2-Cyclohexen-1-one, 2-methyl-5-(1-methylethenyl)-, (R)-; p-Mentha-6,8-dien-2-one, (R)-(-)-; (-)-(R)-Carvone; (-)-p-Mentha-6,8-dien-2-one; (R)-(-)-Carvone; L(-)-Carvone; Levo-carvone; l-6,8(9)-p-Menthadien-2-one; l-1-Methyl-4-isopropenyl-6-cyclohexen-2-one; (4R)-(-)-Carvone; 5-Isopropenyl-2-methyl-2-cyclohexen-1-one, (R)-; (R)-Carvone; 2-Cyclohexen-1-one, 2-methyl-5-(1-methylethenyl)-, (5R)-; L-Carvone; l-p-mentha-1(6),8-dien-2-one; Carvone

Phase change data

Data compiled by: Robert L. Brown and Stephen E. Stein
Quantity | Value | Units | Method | Reference | Comment |
---|---|---|---|---|---|
Tboil | 501.7 | K | N/A | Aldrich Chemical Company Inc., 1990 | |
Tboil | 504.2 | K | N/A | Weast and Grasselli, 1989 |

Gas phase ion energetics data

Data compiled by: Henry M. Rosenstock, Keith Draxl, Bruce W. Steiner, and John T. Herron
Ionization energy determinations
IE (eV) | Method | Reference |
---|---|---|
9.77 | EI | Bunau, Schade, et al., 1967 |
Appearance energy determinations
Ion | AE (eV) | Other Products | Method | Reference | Comment |
---|---|---|---|---|---|
C9H11O+ | 10.1 | CH3 | EI | Bunau, Schade, et al., 1967 |

References

Aldrich Chemical Company Inc., 1990
Aldrich Chemical Company Inc.,
Catalog Handbook of Fine Chemicals, Aldrich Chemical Company, Inc., Milwaukee WI, 1990, 1. [all data]
Weast and Grasselli, 1989
CRC Handbook of Data on Organic Compounds, 2nd Editon, Weast,R.C and Grasselli, J.G., ed(s)., CRC Press, Inc., Boca Raton, FL, 1989, 1. [all data]
Bunau, Schade, et al., 1967
Bunau, G.v.; Schade, G.; Gollnick, K.,
Massenspektrometrische Untersuchungen von Terpenen. I.Monoterpenaldehyde und -ketone,
Z. Anal. Chem., 1967, 227, 173. [all data]