1,3-Pentadiyne, 1,5,5,5-tetrafluoro-
- Formula: C5F4
- Molecular weight: 136.0471
- IUPAC Standard InChIKey: MPUNIKDSZGUONG-UHFFFAOYSA-N
- CAS Registry Number: 64788-24-5
- Chemical structure:
View 3d structure (requires JavaScript / HTML 5) - Other names: 1,3-Pentadiyne, 5,5,5-trifluoro-

Gas phase ion energetics data

Data compiled by: Sharon G. Lias, Rhoda D. Levin, and Sherif A. Kafafi
Ionization energy determinations
IE (eV) | Method | Reference | Comment |
---|---|---|---|
10.58 | PE | Bieri, Asbrink, et al., 1981 | |
10.85 | PE | Bieri, Heilbronner, et al., 1977 | Vertical value |

References

Bieri, Asbrink, et al., 1981
Bieri, G.; Asbrink, L.; Von Niessen, W.,
30.4 nm He(II) photoelectron spectra of organic molecules. Part IV. Fluoro-compounds (C,H,F),
J. Electron Spectrosc. Relat. Phenom., 1981, 23, 281. [all data]
Bieri, Heilbronner, et al., 1977
Bieri, G.; Heilbronner, E.; Stadelmann, J.-P.; Vogt, J.; von Niessen, W.,
Electronic states of difluoroacetylene, difluorodiacetylene, and perfluoropentadiyne-1,3 radical cations. A photoelectron spectroscopic investigation,
J. Am. Chem. Soc., 1977, 99, 6832. [all data]