4α,8α-(Methanothiomethano)naphthalene-10-oxide
- Formula: C12H12OS
- Molecular weight: 204.288
- IUPAC Standard InChIKey: XWFMHDCMXVMYIN-UHFFFAOYSA-N
- CAS Registry Number: 64776-55-2
- Chemical structure:
View 3d structure (requires JavaScript / HTML 5) - Permanent link for this species. Use this link for bookmarking this species for future reference.

Gas phase ion energetics data

Data compiled by: Sharon G. Lias, Rhoda D. Levin, and Sherif A. Kafafi
Ionization energy determinations
IE (eV) | Method | Reference | Comment |
---|---|---|---|
8.44 | PE | Bohm and Gleiter, 1979 | Vertical value |

References

Bohm and Gleiter, 1979
Bohm, M.C.; Gleiter, R.,
Electronic structure and reactivity of propellanes,
Tetrahedron, 1979, 35, 675. [all data]