Acetic acid, iodo-
- Formula: C2H3IO2
- Molecular weight: 185.9485
- IUPAC Standard InChIKey: JDNTWHVOXJZDSN-UHFFFAOYSA-N
- CAS Registry Number: 64-69-7
- Chemical structure:

Phase change data

Data compiled by: William E. Acree, Jr., James S. Chickos
Quantity | Value | Units | Method | Reference | Comment |
---|---|---|---|---|---|
ΔsubH° | 20.7 ± 0.24 | kcal/mol | ME | Lagoa, Diogo, et al., 2001 |
Enthalpy of fusion
ΔfusH (kcal/mol) | Temperature (K) | Method | Reference |
---|---|---|---|
3.70 | 355.1 | DSC | Lagoa, Diogo, et al., 2001 |

Gas phase ion energetics data

Data compiled as indicated in comments:
B - John E. Bartmess
LLK - Sharon G. Lias, Rhoda D. Levin, and Sherif A. Kafafi
Ionization energy determinations
IE (eV) | Method | Reference | Comment |
---|---|---|---|
9.6 | PE | Watanabe, Yokoyama, et al., 1973 | LLK |
11.03 | PE | Watanabe, Yokoyama, et al., 1973 | Vertical value; LLK |
De-protonation reactions
By formula: C2H2IO2- + H+ = C2H3IO2
Quantity | Value | Units | Method | Reference | Comment |
---|---|---|---|---|---|
ΔrH° | 334.7 ± 2.2 | kcal/mol | G+TS | Caldwell, Renneboog, et al., 1989 | gas phase; B |
Quantity | Value | Units | Method | Reference | Comment |
ΔrG° | 327.7 ± 2.0 | kcal/mol | IMRE | Caldwell, Renneboog, et al., 1989 | gas phase; B |

Reaction thermochemistry data

Data compiled by: John E. Bartmess

Individual Reactions

ICH2CO2 anion + Hydrogen cation = Acetic acid, iodo-

By formula: C2H2IO2- + H+ = C2H3IO2

Quantity Value Units Method Reference Comment
Δr334.7 ± 2.2kcal/molG+TSCaldwell, Renneboog, et al., 1989gas phase
Quantity Value Units Method Reference Comment
Δr327.7 ± 2.0kcal/molIMRECaldwell, Renneboog, et al., 1989gas phase

References

Lagoa, Diogo, et al., 2001
Lagoa, Ana L.C.; Diogo, Hermínio P.; Dias, M. Pilar; Minas da Piedade, Manuel E.; Amaral, Luísa M.P.F.; Ribeiro da Silva, Manuel A.V.; Martinho Simões, José A.; Guedes, Rita C.; Costa Cabral, Benedito J.; Schwarz, Karsten; Epple, Matthias,
Energetics of C-Cl, C-Br, and C-I Bonds in Haloacetic Acids: Enthalpies of Formation of XCH2COOH (X=Cl, Br, I) Compounds and the Carboxymethyl Radical,
Chem. Eur. J., 2001, 7, 2, 483-489, https://doi.org/10.1002/1521-3765(20010119)7:2<483::AID-CHEM483>3.0.CO;2-A
. [all data]
Watanabe, Yokoyama, et al., 1973
Watanabe, I.; Yokoyama, Y.; Ikeda, S.,
Lone pair ionization potentials of carboxylic acids determined by He(I) photoelectron spectroscopy,
Bull. Chem. Soc. Jpn., 1973, 46, 1959. [all data]
Caldwell, Renneboog, et al., 1989
Caldwell, G.; Renneboog, R.; Kebarle, P.,
Gas Phase Acidities of Aliphatic Carboxylic Acids, Based on Measurements of Proton Transfer Equilibria,
Can. J. Chem., 1989, 67, 4, 661, https://doi.org/10.1139/v89-092
. [all data]