1-Penten-3-yne
- Formula: C5H6
- Molecular weight: 66.1011
- IUPAC Standard InChIKey: FILUFGAZMJGNEN-UHFFFAOYSA-N
- CAS Registry Number: 646-05-9
- Chemical structure:
View 3d structure (requires JavaScript / HTML 5) - Other names: Methyl vinylacetylene; Pyrylen; Pyrylene; Vinylmethylacetylene; CH2=CHC≡CCH3; 1-Pentene-3-yne

Phase change data

Data compiled as indicated in comments:
BS - Robert L. Brown and Stephen E. Stein
TRC - Thermodynamics Research Center, NIST Boulder Laboratories, Chris Muzny director
Quantity | Value | Units | Method | Reference | Comment |
---|---|---|---|---|---|
Tboil | 332.7 | K | N/A | Weast and Grasselli, 1989 | BS |
Tboil | 332.4 | K | N/A | Petrov, Kolesova, et al., 1957 | Uncertainty assigned by TRC = 1. K; TRC |
Tboil | 332.4 | K | N/A | Jacobson and Carothers, 1933 | Uncertainty assigned by TRC = 3. K; TRC |

Gas phase ion energetics data

Data evaluated as indicated in comments:
L - Sharon G. Lias
Data compiled as indicated in comments:
LLK - Sharon G. Lias, Rhoda D. Levin, and Sherif A. Kafafi
RDSH - Henry M. Rosenstock, Keith Draxl, Bruce W. Steiner, and John T. Herron
Quantity | Value | Units | Method | Reference | Comment |
---|---|---|---|---|---|
IE (evaluated) | 9.00 ± 0.01 | eV | N/A | N/A | L |
Ionization energy determinations
IE (eV) | Method | Reference | Comment |
---|---|---|---|
9.00 ± 0.01 | PE | Carlier, Mouvier, et al., 1979 | LLK |
8.1 | EI | Polyakova, Zimina, et al., 1960 | RDSH |
9.4 | EI | Polyakova, Zimina, et al., 1959 | RDSH |
9.1 ± 0.1 | PE | Bieri, Burger, et al., 1977 | Vertical value; LLK |
9.06 ± 0.03 | PE | Van Hoorn, 1975 | Vertical value; LLK |

References

Weast and Grasselli, 1989
CRC Handbook of Data on Organic Compounds, 2nd Editon, Weast,R.C and Grasselli, J.G., ed(s)., CRC Press, Inc., Boca Raton, FL, 1989, 1. [all data]
Petrov, Kolesova, et al., 1957
Petrov, A.A.; Kolesova, V.A.; Porfir'eva, Y.I.,
Conjugated Systems. LXXVIII Raman Spectra and Reactivity of Vinylacetylenic Hydrocarbons,
Zh. Obshch. Khim., 1957, 27, 2081-7. [all data]
Jacobson and Carothers, 1933
Jacobson, R.A.; Carothers, W.H.,
Acetylene polymers and their derivatives: vii alpha-alkyl-beta- vinylacetylenes,
J. Am. Chem. Soc., 1933, 55, 1622-3. [all data]
Carlier, Mouvier, et al., 1979
Carlier, P.; Mouvier, G.; Mesnard, D.; Miginiac, L.,
Etude par spectrometrie de photoelectrons de la structure electronique des phenyl-alcynes conjugues,
J. Electron Spectrosc. Relat. Phenom., 1979, 16, 147. [all data]
Polyakova, Zimina, et al., 1960
Polyakova, A.A.; Zimina, K.I.; Petrov, A.A.; Khmel'nitskii, R.A.,
Mass spectra of vinylalkylacetylenes,
Zh. Obshch. Khim., 1960, 30, 912, In original 927. [all data]
Polyakova, Zimina, et al., 1959
Polyakova, A.A.; Zimina, K.I.; Petrov, A.A.; Klmel'nitskii, R.A.,
Mass Spectra and the structure of vinylacetylenes,
Dokl. Phys. Chem., 1959, 127, 597, In original 386. [all data]
Bieri, Burger, et al., 1977
Bieri, G.; Burger, F.; Heilbronner, E.; Maier, J.P.,
Valence ionization enrgies of hydrocarbons,
Helv. Chim. Acta, 1977, 60, 2213. [all data]
Van Hoorn, 1975
Van Hoorn, M.D.,
He(I) ionisation potentials and MO calculations of butenyne and the monomethyl-substituted butenynes,
J. Electron Spectrosc. Relat. Phenom., 1975, 6, 65. [all data]
Bruun, et al., 1951
Bruun, T., et al.,
Acta Chem. Scand., 1951, 5, 1244. [all data]