Benzeneselenol
- Formula: C6H6Se
- Molecular weight: 157.07
- IUPAC Standard InChIKey: WDODWFPDZYSKIA-UHFFFAOYSA-N
- CAS Registry Number: 645-96-5
- Chemical structure:
View 3d structure (requires JavaScript / HTML 5) - Other names: Benzene, selenyl-; Phenol, seleno-; Phenyl selenol; Selenophenol

Phase change data

Data compiled as indicated in comments:
BS - Robert L. Brown and Stephen E. Stein
AC - William E. Acree, Jr., James S. Chickos
Quantity | Value | Units | Method | Reference | Comment |
---|---|---|---|---|---|
Tboil | 456.7 | K | N/A | Buckingham and Donaghy, 1982 | BS |
Reduced pressure boiling point
Tboil (K) | Pressure (bar) | Reference | Comment |
---|---|---|---|
330. to 332. | 0.01 | Buckingham and Donaghy, 1982 | BS |
Enthalpy of vaporization
ΔvapH (kJ/mol) | Temperature (K) | Reference | Comment |
---|---|---|---|
45.4 | 395. | Dykyj, Svoboda, et al., 1999 | Based on data from 331. to 458. K.; AC |

Reaction thermochemistry data

Data compiled by: John E. Bartmess
Individual Reactions
C6H5Se- + =
By formula: C6H5Se- + H+ = C6H6Se
Quantity | Value | Units | Method | Reference | Comment |
---|---|---|---|---|---|
ΔrG° | 1386. ± 10. | kJ/mol | IMRB | Guillemin, Riague, et al., 2005 | gas phase |

Gas phase ion energetics data

Data compiled as indicated in comments:
B - John E. Bartmess
LLK - Sharon G. Lias, Rhoda D. Levin, and Sherif A. Kafafi
Ionization energy determinations
IE (eV) | Method | Reference | Comment |
---|---|---|---|
7.7 | PE | Baker, Armen, et al., 1981 | LLK |
8.9 | PE | Baker, Armen, et al., 1981 | Vertical value; LLK |
De-protonation reactions
C6H5Se- + =
By formula: C6H5Se- + H+ = C6H6Se
Quantity | Value | Units | Method | Reference | Comment |
---|---|---|---|---|---|
ΔrG° | 1386. ± 10. | kJ/mol | IMRB | Guillemin, Riague, et al., 2005 | gas phase; B |

References

Buckingham and Donaghy, 1982
Buckingham, J.; Donaghy, S.M.,
Dictionary of Organic Compounds: Fifth Edition, Chapman and Hall, New York, 1982, 1. [all data]
Dykyj, Svoboda, et al., 1999
Dykyj, J.; Svoboda, J.; Wilhoit, R.C.; Frenkel, M.L.; Hall, K.R.,
Vapor Pressure of Chemicals: Part A. Vapor Pressure and Antoine Constants for Hydrocarbons and Sulfur, Selenium, Tellurium and Hydrogen Containing Organic Compounds, Springer, Berlin, 1999, 373. [all data]
Guillemin, Riague, et al., 2005
Guillemin, J.C.; Riague, E.H.; Gal, J.F.; Maria, P.C.; Mo, O.; Yanez, M.,
Acidity trends in alpha,beta-unsaturated sulfur, selenium, and tellurium derivatives: Comparison with C-, Si-, Ge-, Sn-, N-, P-, As-, and Sb-containing analogues,
Chem. Eur. J., 2005, 11, 7, 2145-2153, https://doi.org/10.1002/chem.200400989
. [all data]
Baker, Armen, et al., 1981
Baker, A.D.; Armen, G.H.; Guang-di, Y.,
Photoelectron spectra of alkyl aryl selenides. Electronic and steric factors in the observation of rotamers,
J. Org. Chem., 1981, 46, 4127. [all data]