Titanium, methoxytris(2-propanolato)-

Gas phase ion energetics data

Data compiled by: Sharon G. Lias, Rhoda D. Levin, and Sherif A. Kafafi

Ionization energy determinations

IE (eV) Method Reference Comment
9.1PEBasso-Bert, Cassoux, et al., 1977Vertical value

References

Basso-Bert, Cassoux, et al., 1977
Basso-Bert, M.; Cassoux, P.; Crasnier, F.; Gervais, D.; Labarre, J.-F.; DeLoth, P., Molecular orbitals and photoelectron spectra of some titanium(IV) organometallic compounds, J. Organomet. Chem., 1977, 136, 201. [all data]