Methanone, 2-naphthalenylphenyl-
- Formula: C17H12O
- Molecular weight: 232.2766
- IUPAC Standard InChIKey: SJNXJRVDSTZUFB-UHFFFAOYSA-N
- CAS Registry Number: 644-13-3
- Chemical structure:
View 3d structure (requires JavaScript / HTML 5) - Other names: 2-Benzoylnaphthalene; β-Naphthyl phenyl ketone; 2-Naphthyl phenyl ketone; β-Benzoylnaphthalene; Ketone, 2-naphthyl phenyl; 2-Benzonaphthone; 2'-benzonaphthone

Phase change data

Data compiled by: Robert L. Brown and Stephen E. Stein
Reduced pressure boiling point
Tboil (K) | Pressure (atm) | Reference |
---|---|---|
490.2 | 0.009 | Aldrich Chemical Company Inc., 1990 |
671.2 | 0.992 | Weast and Grasselli, 1989 |

References

Aldrich Chemical Company Inc., 1990
Aldrich Chemical Company Inc.,
Catalog Handbook of Fine Chemicals, Aldrich Chemical Company, Inc., Milwaukee WI, 1990, 1. [all data]
Weast and Grasselli, 1989
CRC Handbook of Data on Organic Compounds, 2nd Editon, Weast,R.C and Grasselli, J.G., ed(s)., CRC Press, Inc., Boca Raton, FL, 1989, 1. [all data]