1,1'-Biphenyl, 4-methyl-
- Formula: C13H12
- Molecular weight: 168.2344
- IUPAC Standard InChIKey: ZZLCFHIKESPLTH-UHFFFAOYSA-N
- CAS Registry Number: 644-08-6
- Chemical structure:
View 3d structure (requires JavaScript / HTML 5) - Other names: Biphenyl, 4-methyl-; p-Methylbiphenyl; p-Methyldiphenyl; 4-Methylbiphenyl; 4-Methyldiphenyl; 4-Phenyltoluene; 1-Methyl-4-phenylbenzene; FEMA 3186; 4-Methyl-1,1'-biphenyl; p-Phenyltoluene; (4-Methylphenyl)benzene; NSC 407669

Gas phase thermochemistry data

Data compiled by: Hussein Y. Afeefy, Joel F. Liebman, and Stephen E. Stein
Quantity | Value | Units | Method | Reference | Comment |
---|---|---|---|---|---|
ΔfH°gas | 138.2 ± 2.9 | kJ/mol | Ccb | Ribeiro da Silva, Matos, et al., 1997 |

Condensed phase thermochemistry data

Data compiled by: Hussein Y. Afeefy, Joel F. Liebman, and Stephen E. Stein
Quantity | Value | Units | Method | Reference | Comment |
---|---|---|---|---|---|
ΔfH°solid | 58.0 ± 2.5 | kJ/mol | Ccb | Ribeiro da Silva, Matos, et al., 1997 | |
Quantity | Value | Units | Method | Reference | Comment |
ΔcH°solid | -6888.6 ± 1.8 | kJ/mol | Ccb | Ribeiro da Silva, Matos, et al., 1997 | Corresponding ΔfHºsolid = 58.0 kJ/mol (simple calculation by NIST; no Washburn corrections) |
ΔcH°solid | -6886.0 ± 7.1 | kJ/mol | Ccb | Brull, 1935 | Reanalyzed by Cox and Pilcher, 1970, Original value = -6884.48 kJ/mol; Corresponding ΔfHºsolid = 55.44 kJ/mol (simple calculation by NIST; no Washburn corrections) |

Phase change data

Data compiled as indicated in comments:
BS - Robert L. Brown and Stephen E. Stein
TRC - Thermodynamics Research Center, NIST Boulder Laboratories, Chris Muzny director
ALS - Hussein Y. Afeefy, Joel F. Liebman, and Stephen E. Stein
AC - William E. Acree, Jr., James S. Chickos
DRB - Donald R. Burgess, Jr.
Quantity | Value | Units | Method | Reference | Comment |
---|---|---|---|---|---|
Tboil | 541. ± 9. | K | AVG | N/A | Average of 8 values; Individual data points |
Quantity | Value | Units | Method | Reference | Comment |
Tfus | 321. ± 3. | K | AVG | N/A | Average of 17 values; Individual data points |
Quantity | Value | Units | Method | Reference | Comment |
ΔsubH° | 80.2 ± 1.4 | kJ/mol | C | Ribeiro da Silva, Matos, et al., 1997 | ALS |
ΔsubH° | 80.2 ± 1.4 | kJ/mol | C | Ribeiro da Silva, Matos, et al., 1997, 2 | AC |
ΔsubH° | 80.2 | kJ/mol | N/A | N/A | DRB |
Reduced pressure boiling point
Tboil (K) | Pressure (bar) | Reference | Comment |
---|---|---|---|
408.2 | 0.020 | Weast and Grasselli, 1989 | BS |

Gas phase ion energetics data

Data evaluated as indicated in comments:
HL - Edward P. Hunter and Sharon G. Lias
Data compiled as indicated in comments:
LLK - Sharon G. Lias, Rhoda D. Levin, and Sherif A. Kafafi
Quantity | Value | Units | Method | Reference | Comment |
---|---|---|---|---|---|
Proton affinity (review) | 817.9 | kJ/mol | N/A | Hunter and Lias, 1998 | HL |
Quantity | Value | Units | Method | Reference | Comment |
Gas basicity | 785.4 | kJ/mol | N/A | Hunter and Lias, 1998 | HL |
Ionization energy determinations
IE (eV) | Method | Reference | Comment |
---|---|---|---|
8.6 ± 0.1 | EI | Bohlmann, Koppel, et al., 1974 | LLK |
7.80 ± 0.02 | PE | Maier and Turner, 1972 | LLK |
Appearance energy determinations
Ion | AE (eV) | Other Products | Method | Reference | Comment |
---|---|---|---|---|---|
C7H7+ | 13.7 ± 0.3 | ? | EI | McLafferty and Winkler, 1974 | LLK |
C13H11+ | 11.3 ± 0.1 | H | EI | Bohlmann, Koppel, et al., 1974 | LLK |

Kovats' RI, non-polar column, isothermal

Column type | Active phase | Temperature (C) | I | Reference | Comment |
---|---|---|---|---|---|
Capillary | OV-1 | 160. | 1504. | Zhang, Chen, et al., 1997 | 25. m/0.2 mm/0.33 μm, N2 |
Capillary | OV-101 | 140. | 1472.7 | Gerasimenko, Kirilenko, et al., 1981 | N2; Column length: 50. m; Column diameter: 0.3 mm |
Capillary | OV-101 | 160. | 1484.5 | Gerasimenko, Kirilenko, et al., 1981 | N2; Column length: 50. m; Column diameter: 0.3 mm |
Packed | SE-30 | 150. | 1478. | Shlyakhov, Anvaer, et al., 1975 | |
Packed | SE-30 | 200. | 1511. | Shlyakhov, Anvaer, et al., 1975 |

Kovats' RI, polar column, isothermal

Column type | Active phase | Temperature (C) | I | Reference | Comment |
---|---|---|---|---|---|
Capillary | SP-1000 | 185. | 2182. | Kríz, Popl, et al., 1974 | N2; Column length: 50. m; Column diameter: 0.25 mm |
Capillary | SP-1000 | 200. | 2134. | Kríz, Popl, et al., 1974 | N2; Column length: 50. m; Column diameter: 0.25 mm |

Van Den Dool and Kratz RI, non-polar column, temperature ramp

Column type | Active phase | I | Reference | Comment |
---|---|---|---|---|
Capillary | DB-5 | 1492.2 | Song, Lai, et al., 2003 | 30. m/0.25 mm/0.25 μm, He, 4. K/min; Tstart: 40. C; Tend: 310. C |
Capillary | DB-5 | 1492.3 | Song, Lai, et al., 2003 | 30. m/0.25 mm/0.25 μm, He, 40. C @ 5. min, 4. K/min; Tend: 310. C |
Capillary | DB-5 | 1482.8 | Song, Lai, et al., 2003 | 30. m/0.25 mm/0.25 μm, He, 2. K/min; Tstart: 40. C; Tend: 310. C |
Capillary | DB-5 | 1492.2 | Song, Lai, et al., 2003 | 30. m/0.25 mm/0.25 μm, He, 4. K/min; Tstart: 40. C; Tend: 310. C |
Capillary | DB-5 | 1497.3 | Song, Lai, et al., 2003 | 30. m/0.25 mm/0.25 μm, He, 6. K/min; Tstart: 40. C; Tend: 310. C |
Capillary | DB-5 | 1482.8 | Lai and Song, 1995 | 30. m/0.25 mm/0.25 μm, He, 2. K/min; Tstart: 40. C; Tend: 310. C |
Capillary | DB-5 | 1492.2 | Lai and Song, 1995 | 30. m/0.25 mm/0.25 μm, He, 4. K/min; Tstart: 40. C; Tend: 310. C |
Capillary | DB-5 | 1497.3 | Lai and Song, 1995 | 30. m/0.25 mm/0.25 μm, He, 6. K/min; Tstart: 40. C; Tend: 310. C |
Capillary | DB-5 | 1492.2 | Lai and Song, 1995 | 30. m/0.25 mm/0.25 μm, He, 4. K/min; Tstart: 40. C; Tend: 310. C |
Capillary | DB-5 | 1492.3 | Lai and Song, 1995 | 30. m/0.25 mm/0.25 μm, He, 40. C @ 5. min, 4. K/min; Tend: 310. C |
Capillary | DB-5 | 1501. | Rostad and Pereira, 1986 | 30. m/0.26 mm/0.25 μm, He, 50. C @ 4. min, 6. K/min, 300. C @ 20. min |

Van Den Dool and Kratz RI, polar column, temperature ramp

Column type | Active phase | I | Reference | Comment |
---|---|---|---|---|
Capillary | Supelcowax-10 | 2117. | Chung, 1999 | 60. m/0.25 mm/0.25 μm, He, 35. C @ 5. min, 2. K/min, 195. C @ 90. min |

Normal alkane RI, non-polar column, isothermal

Column type | Active phase | Temperature (C) | I | Reference | Comment |
---|---|---|---|---|---|
Capillary | OV-101 | 120. | 1473. | Nabivach and Gerasimenko, 1996 | |
Capillary | Polidimethyl siloxane | 130. | 1465. | Nabivach and Gerasimenko, 1996 | |
Capillary | Polidimethyl siloxane | 130. | 1466. | Nabivach and Gerasimenko, 1996 | |
Packed | Polydimethyl siloxane | 183. | 1499. | Ferrand, 1962 |

Normal alkane RI, non-polar column, temperature ramp

Column type | Active phase | I | Reference | Comment |
---|---|---|---|---|
Capillary | Ultra-1 | 1455. | Okumura, 1991 | 25. m/0.32 mm/0.25 μm, He, 3. K/min; Tstart: 80. C; Tend: 260. C |

Normal alkane RI, non-polar column, custom temperature program

Column type | Active phase | I | Reference | Comment |
---|---|---|---|---|
Capillary | Siloxane, 5 % Ph | 1519. | VOC BinBase, 2012 | Program: not specified |
Capillary | Polydimethyl siloxane, 5 % phenyl | 1519. | Skogerson, Wohlgemuth, et al., 2011 | Program: not specified |

Lee's RI, non-polar column, temperature ramp

Column type | Active phase | I | Reference | Comment |
---|---|---|---|---|
Capillary | HP-5 | 257.3 | Shao, Wang, et al., 2006 | 30. m/0.3 mm/0.25 μm, He, 50. C @ 5. min, 5. K/min, 200. C @ 15. min |
Capillary | HP-5 | 254.66 | Piao, Chu, et al., 1999 | 30. m/0.25 mm/0.25 μm, 50. C @ 2. min, 4. K/min, 280. C @ 20. min |
Capillary | CP Sil 8 CB | 256.0 | Bundt, Herbel, et al., 1991 | 50. m/0.25 mm/0.25 μm, He, 4. K/min; Tstart: 80. C; Tend: 300. C |
Capillary | DB-5 | 256.12 | Rostad and Pereira, 1986 | 30. m/0.26 mm/0.25 μm, He, 50. C @ 4. min, 6. K/min, 300. C @ 20. min |
Capillary | SE-52 | 256.69 | Vassilaros, Kong, et al., 1982 | 20. m/0.30 mm/0.25 μm, H2, 40. C @ 2. min, 4. K/min; Tend: 265. C |
Capillary | SE-52 | 254.71 | Lee, Vassilaros, et al., 1979 | 12. m/0.3 mm/0.34 μm, He, 2. K/min; Tstart: 50. C; Tend: 250. C |

Lee's RI, non-polar column, custom temperature program

Column type | Active phase | I | Reference | Comment |
---|---|---|---|---|
Capillary | DB-5 | 255.9 | Fuentes, Font, et al., 2007 | Column length: 60. m; Program: not specified |
Capillary | HP-5 | 255.60 | Reckendorf, 1997 | 25. m/0.2 mm/0.11 μm, He; Program: 106C(0.2min) => 40C/min => 120C => 3C/min => 310C(10min) |
Capillary | CP Sil 8 CB | 256.7 | Bundt, Herbel, et al., 1991 | 50. m/0.25 mm/0.25 μm, He; Program: not specified |

References

Ribeiro da Silva, Matos, et al., 1997
Ribeiro da Silva, M.A.V.; Matos, M.A.R.; do Rio, C.M.A.; Morais, V.M.F.,
Thermochemical and theoretical studies of 4-methylbiphenyl, 4,4'-dimethylbiphenyl, 4,4'-dimethyl-2,2'-bipyridine,
J. Chem. Soc. Farad. Trans, 1997, 93, 3061. [all data]
Brull, 1935
Brull, L.,
Sui calori di combustione di alcuni derivati del bifenil,
Gazz. Chim. Ital., 1935, 65, 19-28. [all data]
Cox and Pilcher, 1970
Cox, J.D.; Pilcher, G.,
Thermochemistry of Organic and Organometallic Compounds, Academic Press, New York, 1970, 1-636. [all data]
Ribeiro da Silva, Matos, et al., 1997, 2
Ribeiro da Silva, Manuel A.V.; Matos, Agostinha R.; do Rio, Carolina M.A.; Morais, Victor M.F.,
Thermochemical and theoretical studies of 4-methylbiphenyl, 4,4´-dimethylbiphenyl, 4,4´-dimethyl-2,2´-bipyridine,
Faraday Trans., 1997, 93, 17, 3061-3065, https://doi.org/10.1039/a701769c
. [all data]
Weast and Grasselli, 1989
CRC Handbook of Data on Organic Compounds, 2nd Editon, Weast,R.C and Grasselli, J.G., ed(s)., CRC Press, Inc., Boca Raton, FL, 1989, 1. [all data]
Hunter and Lias, 1998
Hunter, E.P.; Lias, S.G.,
Evaluated Gas Phase Basicities and Proton Affinities of Molecules: An Update,
J. Phys. Chem. Ref. Data, 1998, 27, 3, 413-656, https://doi.org/10.1063/1.556018
. [all data]
Bohlmann, Koppel, et al., 1974
Bohlmann, F.; Koppel, C.; Muller, B.; Schwarz, H.; Weyerstahl, P.,
Massenspektrometrische Untersuchung isomerer Kohlenwasserstoffe: Struktur und Bildungsenthalpie stabiler (C13H11+) Ionen,
Tetrahedron, 1974, 30, 1011. [all data]
Maier and Turner, 1972
Maier, J.P.; Turner, D.W.,
Steric inhibition of resonance studied by molecular photoelectron spectroscopy. Part I. Biphenyls,
Faraday Discuss. Chem. Soc., 1972, 54, 149. [all data]
McLafferty and Winkler, 1974
McLafferty, F.W.; Winkler, J.,
Gaseous tropylium, benzyl, tolyl, and norbornadienyl cations,
J. Am. Chem. Soc., 1974, 96, 5182. [all data]
Kusakov, et al., 1963
Kusakov, M.M., et al.,
Ultraviolet Absorption Spectra of Aromatic Hydrocarbons, 1963, 182. [all data]
Zhang, Chen, et al., 1997
Zhang, M.; Chen, B.; Shen, S.; Chen, S.,
Compositional studies of high-temperature coal tar by g.c.-FT-i.r. analysis of middle oil fractions,
Fuel, 1997, 76, 5, 415-423, https://doi.org/10.1016/S0016-2361(97)85518-4
. [all data]
Gerasimenko, Kirilenko, et al., 1981
Gerasimenko, V.A.; Kirilenko, A.V.; Nabivach, V.M.,
Capillary gas chromatography of aromatic compounds found in coal tar fractions,
J. Chromatogr., 1981, 208, 1, 9-16, https://doi.org/10.1016/S0021-9673(00)87953-4
. [all data]
Shlyakhov, Anvaer, et al., 1975
Shlyakhov, A.F.; Anvaer, B.I.; Zolotareva, O.V.; Romina, N.N.; Novikova, N.V.; Koreshkova, R.I.,
On the possibility of group indentification of hydrocarbons by gas chromatography from temperature coefficients of retention indices,
Zh. Anal. Khim., 1975, 30, 788-792. [all data]
Kríz, Popl, et al., 1974
Kríz, J.; Popl, M.; Mostecký, J.,
Retention indices of biphenyls and diphenylalkanes,
J. Chromatogr., 1974, 97, 1, 3-13, https://doi.org/10.1016/S0021-9673(01)97577-6
. [all data]
Song, Lai, et al., 2003
Song, C.; Lai, W.-C.; Madhusudan Reddy, K.; Wei, B.,
Chapter 7. Temperature-programmed retention indices for GC and GC-MS of hydrocarbon fuels and simulated distillation GC of heavy oils
in Analytical advances for hydrocarbon research, Hsu,C.S., ed(s)., Kluwer Academic/Plenum Publishers, New York, 2003, 147-193. [all data]
Lai and Song, 1995
Lai, W.-C.; Song, C.,
Temperature-programmed retention indices for g.c. and g.c.-m.s. analysis of coal- and petroleum-derived liquid fuels,
Fuel, 1995, 74, 10, 1436-1451, https://doi.org/10.1016/0016-2361(95)00108-H
. [all data]
Rostad and Pereira, 1986
Rostad, C.E.; Pereira, W.E.,
Kovats and Lee retention indices determined by gas chromatography/mass spectrometry for organic compounds of environmental interest,
J. Hi. Res. Chromatogr. Chromatogr. Comm., 1986, 9, 6, 328-334, https://doi.org/10.1002/jhrc.1240090603
. [all data]
Chung, 1999
Chung, H.Y.,
Volatile components in crabmeats of Charybdis feriatus,
J. Agric. Food Chem., 1999, 47, 6, 2280-2287, https://doi.org/10.1021/jf981027t
. [all data]
Nabivach and Gerasimenko, 1996
Nabivach, V.M.; Gerasimenko, V.A.,
Gas chromatographic retention characteristics of bicyclic aromatic hydrocarbons,
Coke and Chemistry (Rus), 1996, 6, 27-31. [all data]
Ferrand, 1962
Ferrand, R.,
Gas phase chromatography using retention indices for the analysis of tars and their hydrogenation products,
Journees internationales d'etude des methodes de separation immediate at de chromatographie; Org. sur l'initiative du IX., 1962, 132-140. [all data]
Okumura, 1991
Okumura, T.,
retention indices of environmental chemicals on methyl silicone capillary column,
Journal of Environmental Chemistry (Japan), 1991, 1, 2, 333-358, https://doi.org/10.5985/jec.1.333
. [all data]
VOC BinBase, 2012
VOC BinBase,
The volatile compound BinBase (VOC BinBase), 2012, retrieved from http://fiehnlab.ucdavis.edu/projects/VocBinBase and http://binbase.sourceforge.net. [all data]
Skogerson, Wohlgemuth, et al., 2011
Skogerson, K.; Wohlgemuth, G.; Fiehn, O.,
VocBinNase, 2011, retrieved from http://fiehnlab.ucdavis.edu/projects//VocBinBase. [all data]
Shao, Wang, et al., 2006
Shao, X.; Wang, G.; Sun, Y.; Zhang, R.; Xie, K.; Liu, H.,
Determination and Characterization of the Pyrolysis Products of Isoprocarb by GC-MS,
J. Chromatogr. Sci., 2006, 44, 3, 141-147, https://doi.org/10.1093/chromsci/44.3.141
. [all data]
Piao, Chu, et al., 1999
Piao, M.; Chu, S.; Zheng, M.; Xu, X.,
Characterization of the combustion products of polyethylene,
Chemosphere, 1999, 39, 9, 1497-1512, https://doi.org/10.1016/S0045-6535(99)00054-5
. [all data]
Bundt, Herbel, et al., 1991
Bundt, J.; Herbel, W.; Steinhart, H.; Franke, S.; Francke, W.,
Structure-type separation of diesel fuels by solid phase extraction and identification of the two- and three-ring aromatics by capillary GC-mass spectrometry,
J. Hi. Res. Chromatogr., 1991, 14, 2, 91-98, https://doi.org/10.1002/jhrc.1240140205
. [all data]
Vassilaros, Kong, et al., 1982
Vassilaros, D.L.; Kong, R.C.; Later, D.W.; Lee, M.L.,
Linear retention index system for polycyclic aromatic compounds. Critical evaluation and additional indices,
J. Chromatogr., 1982, 252, 1-20, https://doi.org/10.1016/S0021-9673(01)88394-1
. [all data]
Lee, Vassilaros, et al., 1979
Lee, M.L.; Vassilaros, D.L.; White, C.M.; Novotny, M.,
Retention Indices for Programmed-Temperature Capillary-Column Gas Chromatography of Polycyclic Aromatic Hydrocarbons,
Anal. Chem., 1979, 51, 6, 768-773, https://doi.org/10.1021/ac50042a043
. [all data]
Fuentes, Font, et al., 2007
Fuentes, M.J.; Font, R.; Gomez-Rico, M.F.; Martin-Gullon, I.,
Pyrolysis and combustion of waste lubricant oil from diesel cars: Decomposition and pollutants,
J. Anal. Appl. Pyrolysis, 2007, 79, 1-2, 215-226, https://doi.org/10.1016/j.jaap.2006.12.004
. [all data]
Reckendorf, 1997
Reckendorf, R.M.,
Identification of phenyl-substituted polycyclic aromatic compounds in ring furnace gases using GC-MS and GC-AED,
Chromatographia, 1997, 45, 1, 173-182, https://doi.org/10.1007/BF02505557
. [all data]