1,1'-Biphenyl, 2-methyl-
- Formula: C13H12
- Molecular weight: 168.2344
- IUPAC Standard InChIKey: ALLIZEAXNXSFGD-UHFFFAOYSA-N
- CAS Registry Number: 643-58-3
- Chemical structure:
View 3d structure (requires JavaScript / HTML 5) - Other names: Biphenyl, 2-methyl-; o-Methylbiphenyl; 2-Methyl-1,1'-biphenyl; 2-Methylbiphenyl; 2-Phenyltoluene; o-Phenyltoluene; 1-Methyl-2-phenylbenzene; 2-Methyldiphenyl

Phase change data

Data compiled as indicated in comments:
BS - Robert L. Brown and Stephen E. Stein
TRC - Thermodynamics Research Center, NIST Boulder Laboratories, Chris Muzny director
ALS - Hussein Y. Afeefy, Joel F. Liebman, and Stephen E. Stein
DRB - Donald R. Burgess, Jr.
Quantity | Value | Units | Method | Reference | Comment |
---|---|---|---|---|---|
Tboil | 532. ± 7. | K | AVG | N/A | Average of 12 values; Individual data points |
Quantity | Value | Units | Method | Reference | Comment |
Tfus | 272.95 | K | N/A | Goodman and Wise, 1951 | Uncertainty assigned by TRC = 0.15 K; TRC |
Tfus | 418. | K | N/A | Cook, Dickson, et al., 1950 | TRC |
Tfus | 272.95 | K | N/A | Goodman and Wise, 1950 | Uncertainty assigned by TRC = 0.1 K; TRC |
Quantity | Value | Units | Method | Reference | Comment |
ΔvapH° | 15.8 ± 0.1 | kcal/mol | V | Steele, Chirico, et al., 1995 | ALS |
ΔvapH° | 15.8 | kcal/mol | N/A | Steele, Chirico, et al., 1995 | DRB |

Gas phase ion energetics data

Data evaluated as indicated in comments:
HL - Edward P. Hunter and Sharon G. Lias
Data compiled as indicated in comments:
LLK - Sharon G. Lias, Rhoda D. Levin, and Sherif A. Kafafi
Quantity | Value | Units | Method | Reference | Comment |
---|---|---|---|---|---|
Proton affinity (review) | 195.0 | kcal/mol | N/A | Hunter and Lias, 1998 | HL |
Quantity | Value | Units | Method | Reference | Comment |
Gas basicity | 187.2 | kcal/mol | N/A | Hunter and Lias, 1998 | HL |
Ionization energy determinations
IE (eV) | Method | Reference | Comment |
---|---|---|---|
8.10 ± 0.02 | PE | Maier and Turner, 1972 | LLK |

Van Den Dool and Kratz RI, non-polar column, temperature ramp

Data compiled by: NIST Mass Spectrometry Data Center, William E. Wallace, director

Column type CapillaryCapillaryCapillaryCapillaryCapillary
Active phase DB-5DB-5DB-5DB-5DB-5
Column length (m) 30.30.30.30.30.
Carrier gas HeHeHeHeHe
Substrate
Column diameter (mm) 0.250.250.250.250.25
Phase thickness (μm) 0.250.250.250.250.25
Tstart (C) 40.40.40.40.40.
Tend (C) 310.310.310.310.310.
Heat rate (K/min) 2.4.6.2.4.
Initial hold (min)
Final hold (min)
I 1390.01397.61402.31390.1397.6
ReferenceSong, Lai, et al., 2003Song, Lai, et al., 2003Song, Lai, et al., 2003Lai and Song, 1995Lai and Song, 1995
Comment MSDC-RI MSDC-RI MSDC-RI MSDC-RI MSDC-RI
Column type CapillaryCapillary
Active phase DB-5DB-5
Column length (m) 30.30.
Carrier gas HeHe
Substrate
Column diameter (mm) 0.250.26
Phase thickness (μm) 0.250.25
Tstart (C) 40.50.
Tend (C) 310.300.
Heat rate (K/min) 6.6.
Initial hold (min)  4.
Final hold (min)  20.
I 1402.31404.
ReferenceLai and Song, 1995Rostad and Pereira, 1986
Comment MSDC-RI MSDC-RI

Gas phase thermochemistry data

Data compiled by: Hussein Y. Afeefy, Joel F. Liebman, and Stephen E. Stein

Quantity Value Units Method Reference Comment
Δfgas152.8 ± 1.5kJ/molCcbSteele, Chirico, et al., 1995

Condensed phase thermochemistry data

Data compiled by: Hussein Y. Afeefy, Joel F. Liebman, and Stephen E. Stein

Quantity Value Units Method Reference Comment
Δfliquid86.5 ± 1.3kJ/molCcbSteele, Chirico, et al., 1995
Quantity Value Units Method Reference Comment
Δcliquid-6917.1 ± 1.2kJ/molCcbSteele, Chirico, et al., 1995Corresponding Δfliquid = 86.5 kJ/mol (simple calculation by NIST; no Washburn corrections)
Δcliquid-6950.9kJ/molCcbWise, Serijan, et al., 1951Corresponding Δfliquid = 120. kJ/mol (simple calculation by NIST; no Washburn corrections)
Δcliquid-6694.kJ/molCcbGoodman and Wise, 1950Corresponding Δfliquid = -140. kJ/mol (simple calculation by NIST; no Washburn corrections)
Δcliquid-6938.7 ± 7.1kJ/molCcbBrull, 1935Reanalyzed by Cox and Pilcher, 1970, Original value = -6937.57 kJ/mol; Corresponding Δfliquid = 108.2 kJ/mol (simple calculation by NIST; no Washburn corrections)

Kovats' RI, non-polar column, isothermal

View large format table.

Column type Active phase Temperature (C) I Reference Comment
PackedApiezon L170.1438.Kríz, Popl, et al., 1974
PackedApiezon L185.1449.Kríz, Popl, et al., 1974

Kovats' RI, polar column, isothermal

View large format table.

Column type Active phase Temperature (C) I Reference Comment
CapillarySP-1000185.2000.Kríz, Popl, et al., 1974N2; Column length: 50. m; Column diameter: 0.25 mm
CapillarySP-1000200.1960.Kríz, Popl, et al., 1974N2; Column length: 50. m; Column diameter: 0.25 mm

Normal alkane RI, non-polar column, isothermal

View large format table.

Column type Active phase Temperature (C) I Reference Comment
PackedPolydimethyl siloxane183.1388.Ferrand, 1962

Lee's RI, non-polar column, temperature ramp

View large format table.

Column type Active phase I Reference Comment
CapillaryHP-5255.7Wang, Hou, et al., 200730. m/0.30 mm/0.25 μm, Helium, 50. C @ 5. min, 5. K/min, 200. C @ 15. min
CapillaryHP-5256.Shao, Wang, et al., 200630. m/0.3 mm/0.25 μm, He, 50. C @ 5. min, 5. K/min, 200. C @ 15. min
CapillaryHP-5239.57Marynowski, Pieta, et al., 200460. m/0.25 mm/0.25 μm, He, 3. K/min; Tstart: 35. C; Tend: 300. C
CapillaryHP-5239.57Marynowski, Pieta, et al., 200460. m/0.25 mm/0.25 μm, He, 3. K/min; Tstart: 35. C; Tend: 300. C
CapillaryHP-5239.99Piao, Chu, et al., 199930. m/0.25 mm/0.25 μm, 50. C @ 2. min, 4. K/min, 280. C @ 20. min
CapillaryCP Sil 8 CB240.0Bundt, Herbel, et al., 199150. m/0.25 mm/0.25 μm, He, 4. K/min; Tstart: 80. C; Tend: 300. C
CapillaryDB-5239.84Rostad and Pereira, 198630. m/0.26 mm/0.25 μm, He, 50. C @ 4. min, 6. K/min, 300. C @ 20. min
CapillaryDB-5238.55Tong, Centen, et al., 1985He, 4. K/min; Column length: 30. m; Column diameter: 0.25 mm; Tstart: 90. C; Tend: 325. C
CapillarySE-52255.41Vassilaros, Kong, et al., 198220. m/0.30 mm/0.25 μm, H2, 40. C @ 2. min, 4. K/min; Tend: 265. C
CapillarySE-52238.77Lee, Vassilaros, et al., 197912. m/0.3 mm/0.34 μm, He, 2. K/min; Tstart: 50. C; Tend: 250. C

Lee's RI, non-polar column, custom temperature program

View large format table.

Column type Active phase I Reference Comment
CapillaryDB-5263.9Fuentes, Font, et al., 2007Column length: 60. m; Program: not specified
CapillaryDB-5MS238.2Aracil, Font, et al., 2005Column length: 60. m; Column diameter: 0.25 mm; Program: not specified
CapillaryDB-5238.77Tong, Centen, et al., 1985He; Column length: 30. m; Column diameter: 0.25 mm; Program: not specified

References

Goodman and Wise, 1951
Goodman, I.A.; Wise, P.H.,
Synthesis & purification of some alkylbiphenyls & alkylbicyclohexyls., Natl. Advis. Comm. Aeronaut., Tech. Note NACA TN 2260, Lewis Flight Propulsion Lab., Cleveland, Ohio, 1951. [all data]
Cook, Dickson, et al., 1950
Cook, J.W.; Dickson, G.T.; Jack, J.; Loudon, J.D.; McKeown, J.; MacMillan, J.; Williamson, W.F.,
Colchicine and Related Compounds,
J. Chem. Soc., 1950, 139. [all data]
Goodman and Wise, 1950
Goodman, I.A.; Wise, P.H.,
Dicycloic Hydrocarbons I. 2-Alkylbiphenyls,
J. Am. Chem. Soc., 1950, 72, 3076. [all data]
Steele, Chirico, et al., 1995
Steele, W.V.; Chirico, R.D.; Smith, N.K.,
The standard enthalpies of formation of 2-methylbiphenyl and diphenylmethane,
J. Chem. Thermodyn., 1995, 27, 671-678. [all data]
Hunter and Lias, 1998
Hunter, E.P.; Lias, S.G.,
Evaluated Gas Phase Basicities and Proton Affinities of Molecules: An Update,
J. Phys. Chem. Ref. Data, 1998, 27, 3, 413-656, https://doi.org/10.1063/1.556018
. [all data]
Maier and Turner, 1972
Maier, J.P.; Turner, D.W.,
Steric inhibition of resonance studied by molecular photoelectron spectroscopy. Part I. Biphenyls,
Faraday Discuss. Chem. Soc., 1972, 54, 149. [all data]