cis-2-Nonene
- Formula: C9H18
- Molecular weight: 126.2392
- IUPAC Standard InChIKey: IICQZTQZQSBHBY-HYXAFXHYSA-N
- CAS Registry Number: 6434-77-1
- Chemical structure:
View 3d structure (requires JavaScript / HTML 5) - Stereoisomers:
- Other names: (Z)-2-C9H18; 2-Nonene, (Z)-; (2Z)-2-Nonene; (Z)-2-Nonene

Phase change data

Data compiled by: William E. Acree, Jr., James S. Chickos
Enthalpy of vaporization
ΔvapH (kJ/mol) | Temperature (K) | Method | Reference | Comment |
---|---|---|---|---|
40.7 | 394. | A | Stephenson and Malanowski, 1987 | Based on data from 379. to 424. K. |

Gas phase ion energetics data

Data compiled as indicated in comments:
LLK - Sharon G. Lias, Rhoda D. Levin, and Sherif A. Kafafi
Ionization energy determinations
IE (eV) | Method | Reference | Comment |
---|---|---|---|
8.90 ± 0.01 | PI | Rang, Martinson, et al., 1974 | LLK |

Kovats' RI, polar column, isothermal

Data compiled by: NIST Mass Spectrometry Data Center, William E. Wallace, director

Column type CapillaryCapillaryCapillaryCapillaryCapillary
Active phase PEG 4000PEG 4000PEG 4000PEG 4000Polyethylene Glycol 4000
Column length (m)     80.
Carrier gas
Substrate
Column diameter (mm)     0.25
Phase thickness (μm)
Temperature (C) 100.110.70.80.100.
I 980.981.977.980.980.0
ReferenceRang, Orav, et al., 1988Rang, Orav, et al., 1988Rang, Orav, et al., 1988Rang, Orav, et al., 1988Eisen, Orav, et al., 1972
Comment MSDC-RI MSDC-RI MSDC-RI MSDC-RI MSDC-RI
Column type CapillaryCapillaryCapillaryCapillaryCapillary
Active phase Polyethylene Glycol 4000Polyethylene Glycol 4000PEG 4000PEG 4000PEG 4000
Column length (m) 80.80.80.80.80.
Carrier gas
Substrate
Column diameter (mm) 0.250.250.250.250.25
Phase thickness (μm)
Temperature (C) 70.80.70.100.80.
I 976.7979.7976.7980.979.7
ReferenceEisen, Orav, et al., 1972Eisen, Orav, et al., 1972Orav and Eisen, 1972Orav and Eisen, 1972Orav and Eisen, 1972
Comment MSDC-RI MSDC-RI MSDC-RI MSDC-RI MSDC-RI

References

Stephenson and Malanowski, 1987
Stephenson, Richard M.; Malanowski, Stanislaw,
Handbook of the Thermodynamics of Organic Compounds, 1987, https://doi.org/10.1007/978-94-009-3173-2
. [all data]
Rang, Martinson, et al., 1974
Rang, S.; Martinson, E.; Muurisepp, M.,
Ionization potentials of unsaturated hydrocarbons. 1. n-Alkenes, Eesti NSV Teaduste Akadeemia Toimetised 23,
Eesti. NSV Tead. Akad. Toim., 1974, 352. [all data]